{"text_format":"1","workbook":"xlsx","n_sheets":6,"sheets":["Instruções","Proposta Técnica","Proposta Comercial","MEMÓRIA DE CÁLCULO","TDR Técnica","TDR Comercial"],"not_rendered":{"charts":0,"images":1,"macros":1,"external_links":0,"defined_names":0,"comments":4,"pivot_tables":0},"unopened":[],"bounds":{"document_bytes":16777216,"sheet_cells":100000,"rows_first":2000,"rows_last":500,"rows_between":2000,"halvings":0,"cell_chars":16384,"cell_head_chars":4096},"cells_cut":0,"cells_raw":0,"read":"whole","date_system":"1900"}

{"sheet":"Instruções","index":0,"n_rows":7,"n_cols":4,"rows_kept":7,"cut":false,"hidden":false,"merged":[[0,1,0,3],[2,1,2,3]]}
[null,"INSTRUÇÕES"]
[]
[null,"PRIMEIROS PASSOS PARA UTILIZAÇÃO DA PLANILHA"]
[]
[null,"1º","Instruções","Preencha atentamente todos os campos em branco. Em caso de dúvidas sobre o preenchimento, verifique o canto superior direito das células, onde tem um triangulo vermelho com observações e direcionamento sobre como deve ser feito o preenchimento."]
[null,"2º","Proposta Técnica","Preencha as informações no modelo proposto, dessa maneira seu orçamento será analisado pela equipe técnica e financeira do WWF. Não deixe nenhum campo em branco. Caso esqueça de preencher algum campo, terá que reenviar sua proposta."]
[null,"3º","Proposta Comercial","Preencha somente os campos em branco. Descreva de forma sucinta e objetiva os critérios para as condições de pagamento. Lembre-se de inserir o valor bruto de sua proposta."]

{"sheet":"Proposta Técnica","index":1,"n_rows":135,"n_cols":13,"rows_kept":135,"cut":false,"hidden":false,"merged":[[2,3,2,4],[3,3,3,4],[2,6,2,7],[3,6,3,7],[0,2,0,8],[32,2,32,7],[20,3,20,6],[7,5,7,6],[8,5,8,6],[9,5,9,6],[10,5,10,6],[11,5,11,6],[12,5,12,6],[13,5,13,6],[14,5,14,6],[15,5,15,6],[16,5,16,6],[18,5,18,6],[17,5,17,6],[26,3,26,6],[27,3,27,6],[28,3,28,6],[29,3,29,6],[30,3,30,6],[4,3,4,4],[21,3,21,6],[22,3,22,6],[23,3,23,6],[24,3,24,6],[25,3,25,6],[6,2,6,10],[4,6,4,7]]}
[null,null,"PROPOSTA TÉCNICA"]
[]
[null,null,"Fornecedor",null,null,"CNPJ"]
[null,null,"Projeto","Mapeamento Politicas Atores Corredores Azuis",null,"SC","005689"]
[null,null,"CNAE da Nota Fiscal","CNAE",null,"Código de prestação serviço"]
[]
[null,null,"Composição da Equipe e Atribuição de Responsabilidades"]
[null,null,"Nome","Cargo/Área de Especialidade","Atividade/Responsabilidade Atribuída","Link",null,"Telefone","Email","Qtd. Horas","R$/Hora"]
[]
[]
[]
[]
[]
[]
[]
[]
[]
[]
[]
[]
[null,null,"Critério Técnico","Resposta/Justificativa"]
[null,null,"Critério Técnico 1","Experiência comprovada em análise de políticas públicas, marcos legais e instrumentos de governança oceânica, incluindo mapeamentos institucionais."]
[null,null,"Critério Técnico 2","Capacidade de mapeamento e de articulação com partes interessadas (governo, academia e sociedade civil) e experiência prévia em análises de stakeholders."]
[null,null,"Critério Técnico 3","Conhecimento sobre conservação de cetáceos e espécies marinhas migratórias no Brasil e sobre processos e acordos internacionais relevantes (CMS, ZOPACAS, BBNJ e IWC)."]
[null,null,"Critério Técnico 4","Qualidade, clareza e consistência da proposta metodológica e adequação/exequibilidade do cronograma proposto."]
[null,null,"Critério Técnico 5","Qualificação acadêmica e técnica da equipe designada e capacidade de produção de relatórios de alta qualidade em português e inglês.",null,null,null,null,null,null,null,null,"Sim"]
[null,null,"Critério Técnico 6",null,null,null,null,null,null,null,null,null,"Não"]
[null,null,"Critério Técnico 7"]
[null,null,"Critério Técnico 8"]
[null,null,"Critério Técnico 9"]
[null,null,"Critério Técnico 10"]
[]
[null,null,"PROPOSTA TÉCNICA"]
[null,null,"Item","Produto/Entregável","Atividade/Plano de Trabalho","Qtde.","Unid. de medida","Prazo de Entrega Estimado",null,null,null,null,"Início"]
[null,null,null,"Descreva produtos/serviços entregáveis, quantificáveis, de modo que seja possível contabilizar e associar a prazos de entrega","Descreva as atividades/plano de trabalho que será necessária para a entrega do produto em questão.","Insira a quantidade conforme unidade de medida ao lado","Indique a unidade de medida disponível conforme lista de seleção abaixo","Insira prazo estimado para entrega após a assinatura do contrato"]
[null,null,1,"Plano de trabalho e cronograma detalhados, com a abordagem metodológica proposta para a execução do componente institucional e de governança do diagnóstico",null,null,null,"15 dias",null,null,null,null,"Hora"]
[null,null,2,"Relatório preliminar de mapeamento de políticas, marcos legais e arranjos institucionais; e de mapeamento de atores-chave (órgãos governamentais, instituições de pesquisa, organizações não governamentais e parceiros regionais).",null,null,null,"60 dias",null,null,null,null,"Dia"]
[null,null,3,"Relatório de analise das políticas, marcos legais e arranjos institucionais — nacionais e internacionais — para relevantes para a proteção de baleias e seus corredores ecológicos no Brasil e na região do Atlântico Sul, com análise das oportunidades de avanço para agenda e de alinhamento da Iniciativa Corredores Azuis com processos da CMS, IWC e da ZOPACAS.",null,null,null,"153 dias",null,null,null,null,"Semana"]
[null,null,4,"Relatório preliminar de mapeamento de atores-chave (órgãos governamentais, instituições de pesquisa, organizações não governamentais e parceiros regionais) pós-eleições, com análise de seus papéis, interesse e poder em relação à conservação de cetáceos e à governança de corredores azuis.",null,null,null,"153 dias",null,null,null,null,"Mês"]
[null,null,5,"Versão final consolidada dos relatórios institucional e de governança, com insumos do Workshop de Corredores Azuis do Atlântico Sul",null,null,null,"195 dias",null,null,null,null,"Caixa"]
[null,null,null,null,null,null,null,null,null,null,null,null,"Unidade"]
[null,null,null,null,null,null,null,null,null,null,null,null,"Cento"]
[]
[null,null,{"$f":"IF(D44=\"\",\"\",C43+1)","v":""}]
[null,null,""]
[null,null,""]
[null,null,""]
[null,null,""]
[null,null,""]
[null,null,""]
[null,null,""]
[null,null,""]
[null,null,""]
[null,null,""]
[null,null,""]
[null,null,""]
[null,null,""]
[null,null,""]
[null,null,""]
[null,null,""]
[null,null,""]
[null,null,""]
[null,null,""]
[null,null,""]
[null,null,""]
[null,null,""]
[null,null,""]
[null,null,""]
[null,null,""]
[null,null,""]
[null,null,""]
[null,null,""]
[null,null,""]
[null,null,""]
[null,null,""]
[null,null,""]
[null,null,""]
[null,null,""]
[null,null,""]
[null,null,""]
[null,null,""]
[null,null,""]
[null,null,""]
[null,null,""]
[null,null,""]
[null,null,""]
[null,null,""]
[null,null,""]
[null,null,""]
[null,null,""]
[null,null,""]
[null,null,""]
[null,null,""]
[null,null,""]
[null,null,""]
[null,null,""]
[null,null,""]
[null,null,""]
[null,null,""]
[null,null,""]
[null,null,""]
[null,null,{"$f":"IF(D102=\"\",\"\",C101+1)","v":""}]
[null,null,""]
[null,null,""]
[null,null,""]
[null,null,""]
[null,null,""]
[null,null,""]
[null,null,""]
[null,null,""]
[null,null,""]
[null,null,""]
[null,null,""]
[null,null,""]
[null,null,""]
[null,null,""]
[null,null,""]
[null,null,""]
[null,null,""]
[null,null,""]
[null,null,""]
[null,null,""]
[null,null,""]
[null,null,""]
[null,null,""]
[null,null,""]
[null,null,""]
[null,null,""]
[null,null,""]
[null,null,""]
[null,null,""]
[null,null,""]
[null,null,""]
[null,null,""]
[null,null,""]

{"sheet":"Proposta Comercial","index":2,"n_rows":111,"n_cols":11,"rows_kept":111,"cut":false,"hidden":false,"merged":[[9,2,9,10],[8,2,8,10],[0,2,0,10],[2,2,2,3],[2,4,2,7],[3,2,3,3],[3,4,3,7],[4,2,4,3],[5,2,5,3],[4,4,4,7],[5,4,5,7],[6,2,6,3],[6,4,6,7]]}
[null,null,"PROPOSTA COMERCIAL"]
[]
[null,null,"Fornecedor",null,{"$f":"IF('Proposta Técnica'!D3=\"\",\"\",'Proposta Técnica'!D3)","v":""},null,null,null,"Valor Total (Bruto)"]
[null,null,"Projeto",null,{"$f":"IF('Proposta Técnica'!D4=\"\",\"\",'Proposta Técnica'!D4)","v":"Mapeamento Politicas Atores Corredores Azuis"},null,null,null,{"$f":"SUM(I12:I111)","v":0}]
[null,null,"CNPJ",null,{"$f":"IF('Proposta Técnica'!G3=\"\",\"\",'Proposta Técnica'!G3)","v":""}]
[null,null,"SC",null,{"$f":"IF('Proposta Técnica'!G4=\"\",\"\",'Proposta Técnica'!G4)","v":"005689"},null,null,null,"Código de prestação serviço"]
[null,null,"CNAE",null,{"$f":"IF('Proposta Técnica'!D5=\"\",\"\",'Proposta Técnica'!D5)","v":"CNAE"},null,null,null,{"$f":"'Proposta Técnica'!G5","v":0}]
[]
[null,null,"PROPOSTA COMERCIAL"]
[null,null,"Não se esqueça de considerar os custos de deslocamento (viagem, hospedagem) e insumos (material necessário) já no valor dos produtos dispostos nesta proposta! \nNão serão pagos valores adicionais aos previstos na proposta."]
[null,null,"Item","Descrição Atividade/Produto","Qtde.","Unid. Medida","Prazo de Entrega","Valor Unitário (Bruto)","Valor Total (Bruto)","Parcela","Condição de desembolso  "]
[null,null,{"$f":"IF('Proposta Técnica'!C36=\"\",\"\",'Proposta Técnica'!C36)","v":1},{"$f":"IF('Proposta Técnica'!D36=\"\",\"\",'Proposta Técnica'!D36)","v":"Plano de trabalho e cronograma detalhados, com a abordagem metodológica proposta para a execução do componente institucional e de governança do diagnóstico"},{"$f":"IF('Proposta Técnica'!F36=\"\",\"\",'Proposta Técnica'!F36)","v":""},{"$f":"IF('Proposta Técnica'!G36=\"\",\"\",'Proposta Técnica'!G36)","v":""},{"$f":"IF('Proposta Técnica'!H36=\"\",\"\",'Proposta Técnica'!H36)","v":"15 dias"},0,{"$f":"IFERROR(H12*E12,\"\")","v":""},null,"\nApós assinatura do contrato + entrega do produto + aprovação + Entrega de NF"]
[null,null,{"$f":"IF('Proposta Técnica'!C37=\"\",\"\",'Proposta Técnica'!C37)","v":2},{"$f":"IF('Proposta Técnica'!D37=\"\",\"\",'Proposta Técnica'!D37)","v":"Relatório preliminar de mapeamento de políticas, marcos legais e arranjos institucionais; e de mapeamento de atores-chave (órgãos governamentais, instituições de pesquisa, organizações não governamentais e parceiros regionais)."},{"$f":"IF('Proposta Técnica'!F37=\"\",\"\",'Proposta Técnica'!F37)","v":""},{"$f":"IF('Proposta Técnica'!G37=\"\",\"\",'Proposta Técnica'!G37)","v":""},{"$f":"IF('Proposta Técnica'!H37=\"\",\"\",'Proposta Técnica'!H37)","v":"60 dias"},0,{"$f":"IFERROR(H13*E13,\"\")","v":""},null,"\n15 dias após entrega do produto + aprovação + Entrega de NF"]
[null,null,{"$f":"IF('Proposta Técnica'!C38=\"\",\"\",'Proposta Técnica'!C38)","v":3},{"$f":"IF('Proposta Técnica'!D38=\"\",\"\",'Proposta Técnica'!D38)","v":"Relatório de analise das políticas, marcos legais e arranjos institucionais — nacionais e internacionais — para relevantes para a proteção de baleias e seus corredores ecológicos no Brasil e na região do Atlântico Sul, com análise das oportunidades de avanço para agenda e de alinhamento da Iniciativa Corredores Azuis com processos da CMS, IWC e da ZOPACAS."},{"$f":"IF('Proposta Técnica'!F38=\"\",\"\",'Proposta Técnica'!F38)","v":""},{"$f":"IF('Proposta Técnica'!G38=\"\",\"\",'Proposta Técnica'!G38)","v":""},{"$f":"IF('Proposta Técnica'!H38=\"\",\"\",'Proposta Técnica'!H38)","v":"153 dias"},0,"",null,"\n15 dias após entrega do produto + aprovação + Entrega de NF"]
[null,null,{"$f":"IF('Proposta Técnica'!C39=\"\",\"\",'Proposta Técnica'!C39)","v":4},{"$f":"IF('Proposta Técnica'!D39=\"\",\"\",'Proposta Técnica'!D39)","v":"Relatório preliminar de mapeamento de atores-chave (órgãos governamentais, instituições de pesquisa, organizações não governamentais e parceiros regionais) pós-eleições, com análise de seus papéis, interesse e poder em relação à conservação de cetáceos e à governança de corredores azuis."},{"$f":"IF('Proposta Técnica'!F39=\"\",\"\",'Proposta Técnica'!F39)","v":""},{"$f":"IF('Proposta Técnica'!G39=\"\",\"\",'Proposta Técnica'!G39)","v":""},{"$f":"IF('Proposta Técnica'!H39=\"\",\"\",'Proposta Técnica'!H39)","v":"153 dias"},0,"",null,"\n15 dias após entrega do produto + aprovação + Entrega de NF"]
[null,null,{"$f":"IF('Proposta Técnica'!C40=\"\",\"\",'Proposta Técnica'!C40)","v":5},{"$f":"IF('Proposta Técnica'!D40=\"\",\"\",'Proposta Técnica'!D40)","v":"Versão final consolidada dos relatórios institucional e de governança, com insumos do Workshop de Corredores Azuis do Atlântico Sul"},{"$f":"IF('Proposta Técnica'!F40=\"\",\"\",'Proposta Técnica'!F40)","v":""},{"$f":"IF('Proposta Técnica'!G40=\"\",\"\",'Proposta Técnica'!G40)","v":""},{"$f":"IF('Proposta Técnica'!H40=\"\",\"\",'Proposta Técnica'!H40)","v":"195 dias"},0,"",null,"\n15 dias após entrega do produto + aprovação + Entrega de NF"]
[null,null,{"$f":"IF('Proposta Técnica'!C41=\"\",\"\",'Proposta Técnica'!C41)","v":""},{"$f":"IF('Proposta Técnica'!D41=\"\",\"\",'Proposta Técnica'!D41)","v":""},{"$f":"IF('Proposta Técnica'!F41=\"\",\"\",'Proposta Técnica'!F41)","v":""},{"$f":"IF('Proposta Técnica'!G41=\"\",\"\",'Proposta Técnica'!G41)","v":""},{"$f":"IF('Proposta Técnica'!H41=\"\",\"\",'Proposta Técnica'!H41)","v":""},0,""]
[null,null,{"$f":"IF('Proposta Técnica'!C42=\"\",\"\",'Proposta Técnica'!C42)","v":""},{"$f":"IF('Proposta Técnica'!D42=\"\",\"\",'Proposta Técnica'!D42)","v":""},{"$f":"IF('Proposta Técnica'!F42=\"\",\"\",'Proposta Técnica'!F42)","v":""},{"$f":"IF('Proposta Técnica'!G42=\"\",\"\",'Proposta Técnica'!G42)","v":""},{"$f":"IF('Proposta Técnica'!H42=\"\",\"\",'Proposta Técnica'!H42)","v":""},0,""]
[null,null,{"$f":"IF('Proposta Técnica'!C43=\"\",\"\",'Proposta Técnica'!C43)","v":""},{"$f":"IF('Proposta Técnica'!D43=\"\",\"\",'Proposta Técnica'!D43)","v":""},{"$f":"IF('Proposta Técnica'!F43=\"\",\"\",'Proposta Técnica'!F43)","v":""},{"$f":"IF('Proposta Técnica'!G43=\"\",\"\",'Proposta Técnica'!G43)","v":""},{"$f":"IF('Proposta Técnica'!H43=\"\",\"\",'Proposta Técnica'!H43)","v":""},0,""]
[null,null,{"$f":"IF('Proposta Técnica'!C44=\"\",\"\",'Proposta Técnica'!C44)","v":""},{"$f":"IF('Proposta Técnica'!D44=\"\",\"\",'Proposta Técnica'!D44)","v":""},{"$f":"IF('Proposta Técnica'!F44=\"\",\"\",'Proposta Técnica'!F44)","v":""},{"$f":"IF('Proposta Técnica'!G44=\"\",\"\",'Proposta Técnica'!G44)","v":""},{"$f":"IF('Proposta Técnica'!H44=\"\",\"\",'Proposta Técnica'!H44)","v":""},0,""]
[null,null,{"$f":"IF('Proposta Técnica'!C45=\"\",\"\",'Proposta Técnica'!C45)","v":""},{"$f":"IF('Proposta Técnica'!D45=\"\",\"\",'Proposta Técnica'!D45)","v":""},{"$f":"IF('Proposta Técnica'!F45=\"\",\"\",'Proposta Técnica'!F45)","v":""},{"$f":"IF('Proposta Técnica'!G45=\"\",\"\",'Proposta Técnica'!G45)","v":""},{"$f":"IF('Proposta Técnica'!H45=\"\",\"\",'Proposta Técnica'!H45)","v":""},0,""]
[null,null,{"$f":"IF('Proposta Técnica'!C46=\"\",\"\",'Proposta Técnica'!C46)","v":""},{"$f":"IF('Proposta Técnica'!D46=\"\",\"\",'Proposta Técnica'!D46)","v":""},{"$f":"IF('Proposta Técnica'!F46=\"\",\"\",'Proposta Técnica'!F46)","v":""},{"$f":"IF('Proposta Técnica'!G46=\"\",\"\",'Proposta Técnica'!G46)","v":""},{"$f":"IF('Proposta Técnica'!H46=\"\",\"\",'Proposta Técnica'!H46)","v":""},0,""]
[null,null,{"$f":"IF('Proposta Técnica'!C47=\"\",\"\",'Proposta Técnica'!C47)","v":""},{"$f":"IF('Proposta Técnica'!D47=\"\",\"\",'Proposta Técnica'!D47)","v":""},{"$f":"IF('Proposta Técnica'!F47=\"\",\"\",'Proposta Técnica'!F47)","v":""},{"$f":"IF('Proposta Técnica'!G47=\"\",\"\",'Proposta Técnica'!G47)","v":""},{"$f":"IF('Proposta Técnica'!H47=\"\",\"\",'Proposta Técnica'!H47)","v":""},0,""]
[null,null,{"$f":"IF('Proposta Técnica'!C48=\"\",\"\",'Proposta Técnica'!C48)","v":""},{"$f":"IF('Proposta Técnica'!D48=\"\",\"\",'Proposta Técnica'!D48)","v":""},{"$f":"IF('Proposta Técnica'!F48=\"\",\"\",'Proposta Técnica'!F48)","v":""},{"$f":"IF('Proposta Técnica'!G48=\"\",\"\",'Proposta Técnica'!G48)","v":""},{"$f":"IF('Proposta Técnica'!H48=\"\",\"\",'Proposta Técnica'!H48)","v":""},0,""]
[null,null,{"$f":"IF('Proposta Técnica'!C49=\"\",\"\",'Proposta Técnica'!C49)","v":""},{"$f":"IF('Proposta Técnica'!D49=\"\",\"\",'Proposta Técnica'!D49)","v":""},{"$f":"IF('Proposta Técnica'!F49=\"\",\"\",'Proposta Técnica'!F49)","v":""},{"$f":"IF('Proposta Técnica'!G49=\"\",\"\",'Proposta Técnica'!G49)","v":""},{"$f":"IF('Proposta Técnica'!H49=\"\",\"\",'Proposta Técnica'!H49)","v":""},0,""]
[null,null,{"$f":"IF('Proposta Técnica'!C50=\"\",\"\",'Proposta Técnica'!C50)","v":""},{"$f":"IF('Proposta Técnica'!D50=\"\",\"\",'Proposta Técnica'!D50)","v":""},{"$f":"IF('Proposta Técnica'!F50=\"\",\"\",'Proposta Técnica'!F50)","v":""},{"$f":"IF('Proposta Técnica'!G50=\"\",\"\",'Proposta Técnica'!G50)","v":""},{"$f":"IF('Proposta Técnica'!H50=\"\",\"\",'Proposta Técnica'!H50)","v":""},0,""]
[null,null,{"$f":"IF('Proposta Técnica'!C51=\"\",\"\",'Proposta Técnica'!C51)","v":""},{"$f":"IF('Proposta Técnica'!D51=\"\",\"\",'Proposta Técnica'!D51)","v":""},{"$f":"IF('Proposta Técnica'!F51=\"\",\"\",'Proposta Técnica'!F51)","v":""},{"$f":"IF('Proposta Técnica'!G51=\"\",\"\",'Proposta Técnica'!G51)","v":""},{"$f":"IF('Proposta Técnica'!H51=\"\",\"\",'Proposta Técnica'!H51)","v":""},0,""]
[null,null,{"$f":"IF('Proposta Técnica'!C52=\"\",\"\",'Proposta Técnica'!C52)","v":""},{"$f":"IF('Proposta Técnica'!D52=\"\",\"\",'Proposta Técnica'!D52)","v":""},{"$f":"IF('Proposta Técnica'!F52=\"\",\"\",'Proposta Técnica'!F52)","v":""},{"$f":"IF('Proposta Técnica'!G52=\"\",\"\",'Proposta Técnica'!G52)","v":""},{"$f":"IF('Proposta Técnica'!H52=\"\",\"\",'Proposta Técnica'!H52)","v":""},0,""]
[null,null,{"$f":"IF('Proposta Técnica'!C53=\"\",\"\",'Proposta Técnica'!C53)","v":""},{"$f":"IF('Proposta Técnica'!D53=\"\",\"\",'Proposta Técnica'!D53)","v":""},{"$f":"IF('Proposta Técnica'!F53=\"\",\"\",'Proposta Técnica'!F53)","v":""},{"$f":"IF('Proposta Técnica'!G53=\"\",\"\",'Proposta Técnica'!G53)","v":""},{"$f":"IF('Proposta Técnica'!H53=\"\",\"\",'Proposta Técnica'!H53)","v":""},0,""]
[null,null,{"$f":"IF('Proposta Técnica'!C54=\"\",\"\",'Proposta Técnica'!C54)","v":""},{"$f":"IF('Proposta Técnica'!D54=\"\",\"\",'Proposta Técnica'!D54)","v":""},{"$f":"IF('Proposta Técnica'!F54=\"\",\"\",'Proposta Técnica'!F54)","v":""},{"$f":"IF('Proposta Técnica'!G54=\"\",\"\",'Proposta Técnica'!G54)","v":""},{"$f":"IF('Proposta Técnica'!H54=\"\",\"\",'Proposta Técnica'!H54)","v":""},0,""]
[null,null,{"$f":"IF('Proposta Técnica'!C55=\"\",\"\",'Proposta Técnica'!C55)","v":""},{"$f":"IF('Proposta Técnica'!D55=\"\",\"\",'Proposta Técnica'!D55)","v":""},{"$f":"IF('Proposta Técnica'!F55=\"\",\"\",'Proposta Técnica'!F55)","v":""},{"$f":"IF('Proposta Técnica'!G55=\"\",\"\",'Proposta Técnica'!G55)","v":""},{"$f":"IF('Proposta Técnica'!H55=\"\",\"\",'Proposta Técnica'!H55)","v":""},0,""]
[null,null,{"$f":"IF('Proposta Técnica'!C56=\"\",\"\",'Proposta Técnica'!C56)","v":""},{"$f":"IF('Proposta Técnica'!D56=\"\",\"\",'Proposta Técnica'!D56)","v":""},{"$f":"IF('Proposta Técnica'!F56=\"\",\"\",'Proposta Técnica'!F56)","v":""},{"$f":"IF('Proposta Técnica'!G56=\"\",\"\",'Proposta Técnica'!G56)","v":""},{"$f":"IF('Proposta Técnica'!H56=\"\",\"\",'Proposta Técnica'!H56)","v":""},0,""]
[null,null,{"$f":"IF('Proposta Técnica'!C57=\"\",\"\",'Proposta Técnica'!C57)","v":""},{"$f":"IF('Proposta Técnica'!D57=\"\",\"\",'Proposta Técnica'!D57)","v":""},{"$f":"IF('Proposta Técnica'!F57=\"\",\"\",'Proposta Técnica'!F57)","v":""},{"$f":"IF('Proposta Técnica'!G57=\"\",\"\",'Proposta Técnica'!G57)","v":""},{"$f":"IF('Proposta Técnica'!H57=\"\",\"\",'Proposta Técnica'!H57)","v":""},0,""]
[null,null,{"$f":"IF('Proposta Técnica'!C58=\"\",\"\",'Proposta Técnica'!C58)","v":""},{"$f":"IF('Proposta Técnica'!D58=\"\",\"\",'Proposta Técnica'!D58)","v":""},{"$f":"IF('Proposta Técnica'!F58=\"\",\"\",'Proposta Técnica'!F58)","v":""},{"$f":"IF('Proposta Técnica'!G58=\"\",\"\",'Proposta Técnica'!G58)","v":""},{"$f":"IF('Proposta Técnica'!H58=\"\",\"\",'Proposta Técnica'!H58)","v":""},0,""]
[null,null,{"$f":"IF('Proposta Técnica'!C59=\"\",\"\",'Proposta Técnica'!C59)","v":""},{"$f":"IF('Proposta Técnica'!D59=\"\",\"\",'Proposta Técnica'!D59)","v":""},{"$f":"IF('Proposta Técnica'!F59=\"\",\"\",'Proposta Técnica'!F59)","v":""},{"$f":"IF('Proposta Técnica'!G59=\"\",\"\",'Proposta Técnica'!G59)","v":""},{"$f":"IF('Proposta Técnica'!H59=\"\",\"\",'Proposta Técnica'!H59)","v":""},0,""]
[null,null,{"$f":"IF('Proposta Técnica'!C60=\"\",\"\",'Proposta Técnica'!C60)","v":""},{"$f":"IF('Proposta Técnica'!D60=\"\",\"\",'Proposta Técnica'!D60)","v":""},{"$f":"IF('Proposta Técnica'!F60=\"\",\"\",'Proposta Técnica'!F60)","v":""},{"$f":"IF('Proposta Técnica'!G60=\"\",\"\",'Proposta Técnica'!G60)","v":""},{"$f":"IF('Proposta Técnica'!H60=\"\",\"\",'Proposta Técnica'!H60)","v":""},0,""]
[null,null,{"$f":"IF('Proposta Técnica'!C61=\"\",\"\",'Proposta Técnica'!C61)","v":""},{"$f":"IF('Proposta Técnica'!D61=\"\",\"\",'Proposta Técnica'!D61)","v":""},{"$f":"IF('Proposta Técnica'!F61=\"\",\"\",'Proposta Técnica'!F61)","v":""},{"$f":"IF('Proposta Técnica'!G61=\"\",\"\",'Proposta Técnica'!G61)","v":""},{"$f":"IF('Proposta Técnica'!H61=\"\",\"\",'Proposta Técnica'!H61)","v":""},0,""]
[null,null,{"$f":"IF('Proposta Técnica'!C62=\"\",\"\",'Proposta Técnica'!C62)","v":""},{"$f":"IF('Proposta Técnica'!D62=\"\",\"\",'Proposta Técnica'!D62)","v":""},{"$f":"IF('Proposta Técnica'!F62=\"\",\"\",'Proposta Técnica'!F62)","v":""},{"$f":"IF('Proposta Técnica'!G62=\"\",\"\",'Proposta Técnica'!G62)","v":""},{"$f":"IF('Proposta Técnica'!H62=\"\",\"\",'Proposta Técnica'!H62)","v":""},0,""]
[null,null,{"$f":"IF('Proposta Técnica'!C63=\"\",\"\",'Proposta Técnica'!C63)","v":""},{"$f":"IF('Proposta Técnica'!D63=\"\",\"\",'Proposta Técnica'!D63)","v":""},{"$f":"IF('Proposta Técnica'!F63=\"\",\"\",'Proposta Técnica'!F63)","v":""},{"$f":"IF('Proposta Técnica'!G63=\"\",\"\",'Proposta Técnica'!G63)","v":""},{"$f":"IF('Proposta Técnica'!H63=\"\",\"\",'Proposta Técnica'!H63)","v":""},0,""]
[null,null,{"$f":"IF('Proposta Técnica'!C64=\"\",\"\",'Proposta Técnica'!C64)","v":""},{"$f":"IF('Proposta Técnica'!D64=\"\",\"\",'Proposta Técnica'!D64)","v":""},{"$f":"IF('Proposta Técnica'!F64=\"\",\"\",'Proposta Técnica'!F64)","v":""},{"$f":"IF('Proposta Técnica'!G64=\"\",\"\",'Proposta Técnica'!G64)","v":""},{"$f":"IF('Proposta Técnica'!H64=\"\",\"\",'Proposta Técnica'!H64)","v":""},0,""]
[null,null,{"$f":"IF('Proposta Técnica'!C65=\"\",\"\",'Proposta Técnica'!C65)","v":""},{"$f":"IF('Proposta Técnica'!D65=\"\",\"\",'Proposta Técnica'!D65)","v":""},{"$f":"IF('Proposta Técnica'!F65=\"\",\"\",'Proposta Técnica'!F65)","v":""},{"$f":"IF('Proposta Técnica'!G65=\"\",\"\",'Proposta Técnica'!G65)","v":""},{"$f":"IF('Proposta Técnica'!H65=\"\",\"\",'Proposta Técnica'!H65)","v":""},0,""]
[null,null,{"$f":"IF('Proposta Técnica'!C66=\"\",\"\",'Proposta Técnica'!C66)","v":""},{"$f":"IF('Proposta Técnica'!D66=\"\",\"\",'Proposta Técnica'!D66)","v":""},{"$f":"IF('Proposta Técnica'!F66=\"\",\"\",'Proposta Técnica'!F66)","v":""},{"$f":"IF('Proposta Técnica'!G66=\"\",\"\",'Proposta Técnica'!G66)","v":""},{"$f":"IF('Proposta Técnica'!H66=\"\",\"\",'Proposta Técnica'!H66)","v":""},0,""]
[null,null,{"$f":"IF('Proposta Técnica'!C67=\"\",\"\",'Proposta Técnica'!C67)","v":""},{"$f":"IF('Proposta Técnica'!D67=\"\",\"\",'Proposta Técnica'!D67)","v":""},{"$f":"IF('Proposta Técnica'!F67=\"\",\"\",'Proposta Técnica'!F67)","v":""},{"$f":"IF('Proposta Técnica'!G67=\"\",\"\",'Proposta Técnica'!G67)","v":""},{"$f":"IF('Proposta Técnica'!H67=\"\",\"\",'Proposta Técnica'!H67)","v":""},0,""]
[null,null,{"$f":"IF('Proposta Técnica'!C68=\"\",\"\",'Proposta Técnica'!C68)","v":""},{"$f":"IF('Proposta Técnica'!D68=\"\",\"\",'Proposta Técnica'!D68)","v":""},{"$f":"IF('Proposta Técnica'!F68=\"\",\"\",'Proposta Técnica'!F68)","v":""},{"$f":"IF('Proposta Técnica'!G68=\"\",\"\",'Proposta Técnica'!G68)","v":""},{"$f":"IF('Proposta Técnica'!H68=\"\",\"\",'Proposta Técnica'!H68)","v":""},0,""]
[null,null,{"$f":"IF('Proposta Técnica'!C69=\"\",\"\",'Proposta Técnica'!C69)","v":""},{"$f":"IF('Proposta Técnica'!D69=\"\",\"\",'Proposta Técnica'!D69)","v":""},{"$f":"IF('Proposta Técnica'!F69=\"\",\"\",'Proposta Técnica'!F69)","v":""},{"$f":"IF('Proposta Técnica'!G69=\"\",\"\",'Proposta Técnica'!G69)","v":""},{"$f":"IF('Proposta Técnica'!H69=\"\",\"\",'Proposta Técnica'!H69)","v":""},0,""]
[null,null,{"$f":"IF('Proposta Técnica'!C70=\"\",\"\",'Proposta Técnica'!C70)","v":""},{"$f":"IF('Proposta Técnica'!D70=\"\",\"\",'Proposta Técnica'!D70)","v":""},{"$f":"IF('Proposta Técnica'!F70=\"\",\"\",'Proposta Técnica'!F70)","v":""},{"$f":"IF('Proposta Técnica'!G70=\"\",\"\",'Proposta Técnica'!G70)","v":""},{"$f":"IF('Proposta Técnica'!H70=\"\",\"\",'Proposta Técnica'!H70)","v":""},0,""]
[null,null,{"$f":"IF('Proposta Técnica'!C71=\"\",\"\",'Proposta Técnica'!C71)","v":""},{"$f":"IF('Proposta Técnica'!D71=\"\",\"\",'Proposta Técnica'!D71)","v":""},{"$f":"IF('Proposta Técnica'!F71=\"\",\"\",'Proposta Técnica'!F71)","v":""},{"$f":"IF('Proposta Técnica'!G71=\"\",\"\",'Proposta Técnica'!G71)","v":""},{"$f":"IF('Proposta Técnica'!H71=\"\",\"\",'Proposta Técnica'!H71)","v":""},0,""]
[null,null,{"$f":"IF('Proposta Técnica'!C72=\"\",\"\",'Proposta Técnica'!C72)","v":""},{"$f":"IF('Proposta Técnica'!D72=\"\",\"\",'Proposta Técnica'!D72)","v":""},{"$f":"IF('Proposta Técnica'!F72=\"\",\"\",'Proposta Técnica'!F72)","v":""},{"$f":"IF('Proposta Técnica'!G72=\"\",\"\",'Proposta Técnica'!G72)","v":""},{"$f":"IF('Proposta Técnica'!H72=\"\",\"\",'Proposta Técnica'!H72)","v":""},0,""]
[null,null,{"$f":"IF('Proposta Técnica'!C73=\"\",\"\",'Proposta Técnica'!C73)","v":""},{"$f":"IF('Proposta Técnica'!D73=\"\",\"\",'Proposta Técnica'!D73)","v":""},{"$f":"IF('Proposta Técnica'!F73=\"\",\"\",'Proposta Técnica'!F73)","v":""},{"$f":"IF('Proposta Técnica'!G73=\"\",\"\",'Proposta Técnica'!G73)","v":""},{"$f":"IF('Proposta Técnica'!H73=\"\",\"\",'Proposta Técnica'!H73)","v":""},0,""]
[null,null,{"$f":"IF('Proposta Técnica'!C74=\"\",\"\",'Proposta Técnica'!C74)","v":""},{"$f":"IF('Proposta Técnica'!D74=\"\",\"\",'Proposta Técnica'!D74)","v":""},{"$f":"IF('Proposta Técnica'!F74=\"\",\"\",'Proposta Técnica'!F74)","v":""},{"$f":"IF('Proposta Técnica'!G74=\"\",\"\",'Proposta Técnica'!G74)","v":""},{"$f":"IF('Proposta Técnica'!H74=\"\",\"\",'Proposta Técnica'!H74)","v":""},0,""]
[null,null,{"$f":"IF('Proposta Técnica'!C75=\"\",\"\",'Proposta Técnica'!C75)","v":""},{"$f":"IF('Proposta Técnica'!D75=\"\",\"\",'Proposta Técnica'!D75)","v":""},{"$f":"IF('Proposta Técnica'!F75=\"\",\"\",'Proposta Técnica'!F75)","v":""},{"$f":"IF('Proposta Técnica'!G75=\"\",\"\",'Proposta Técnica'!G75)","v":""},{"$f":"IF('Proposta Técnica'!H75=\"\",\"\",'Proposta Técnica'!H75)","v":""},0,""]
[null,null,{"$f":"IF('Proposta Técnica'!C76=\"\",\"\",'Proposta Técnica'!C76)","v":""},{"$f":"IF('Proposta Técnica'!D76=\"\",\"\",'Proposta Técnica'!D76)","v":""},{"$f":"IF('Proposta Técnica'!F76=\"\",\"\",'Proposta Técnica'!F76)","v":""},{"$f":"IF('Proposta Técnica'!G76=\"\",\"\",'Proposta Técnica'!G76)","v":""},{"$f":"IF('Proposta Técnica'!H76=\"\",\"\",'Proposta Técnica'!H76)","v":""},0,""]
[null,null,{"$f":"IF('Proposta Técnica'!C77=\"\",\"\",'Proposta Técnica'!C77)","v":""},{"$f":"IF('Proposta Técnica'!D77=\"\",\"\",'Proposta Técnica'!D77)","v":""},{"$f":"IF('Proposta Técnica'!F77=\"\",\"\",'Proposta Técnica'!F77)","v":""},{"$f":"IF('Proposta Técnica'!G77=\"\",\"\",'Proposta Técnica'!G77)","v":""},{"$f":"IF('Proposta Técnica'!H77=\"\",\"\",'Proposta Técnica'!H77)","v":""},0,""]
[null,null,{"$f":"IF('Proposta Técnica'!C78=\"\",\"\",'Proposta Técnica'!C78)","v":""},{"$f":"IF('Proposta Técnica'!D78=\"\",\"\",'Proposta Técnica'!D78)","v":""},{"$f":"IF('Proposta Técnica'!F78=\"\",\"\",'Proposta Técnica'!F78)","v":""},{"$f":"IF('Proposta Técnica'!G78=\"\",\"\",'Proposta Técnica'!G78)","v":""},{"$f":"IF('Proposta Técnica'!H78=\"\",\"\",'Proposta Técnica'!H78)","v":""},0,""]
[null,null,{"$f":"IF('Proposta Técnica'!C79=\"\",\"\",'Proposta Técnica'!C79)","v":""},{"$f":"IF('Proposta Técnica'!D79=\"\",\"\",'Proposta Técnica'!D79)","v":""},{"$f":"IF('Proposta Técnica'!F79=\"\",\"\",'Proposta Técnica'!F79)","v":""},{"$f":"IF('Proposta Técnica'!G79=\"\",\"\",'Proposta Técnica'!G79)","v":""},{"$f":"IF('Proposta Técnica'!H79=\"\",\"\",'Proposta Técnica'!H79)","v":""},0,""]
[null,null,{"$f":"IF('Proposta Técnica'!C80=\"\",\"\",'Proposta Técnica'!C80)","v":""},{"$f":"IF('Proposta Técnica'!D80=\"\",\"\",'Proposta Técnica'!D80)","v":""},{"$f":"IF('Proposta Técnica'!F80=\"\",\"\",'Proposta Técnica'!F80)","v":""},{"$f":"IF('Proposta Técnica'!G80=\"\",\"\",'Proposta Técnica'!G80)","v":""},{"$f":"IF('Proposta Técnica'!H80=\"\",\"\",'Proposta Técnica'!H80)","v":""},0,""]
[null,null,{"$f":"IF('Proposta Técnica'!C81=\"\",\"\",'Proposta Técnica'!C81)","v":""},{"$f":"IF('Proposta Técnica'!D81=\"\",\"\",'Proposta Técnica'!D81)","v":""},{"$f":"IF('Proposta Técnica'!F81=\"\",\"\",'Proposta Técnica'!F81)","v":""},{"$f":"IF('Proposta Técnica'!G81=\"\",\"\",'Proposta Técnica'!G81)","v":""},{"$f":"IF('Proposta Técnica'!H81=\"\",\"\",'Proposta Técnica'!H81)","v":""},0,""]
[null,null,{"$f":"IF('Proposta Técnica'!C82=\"\",\"\",'Proposta Técnica'!C82)","v":""},{"$f":"IF('Proposta Técnica'!D82=\"\",\"\",'Proposta Técnica'!D82)","v":""},{"$f":"IF('Proposta Técnica'!F82=\"\",\"\",'Proposta Técnica'!F82)","v":""},{"$f":"IF('Proposta Técnica'!G82=\"\",\"\",'Proposta Técnica'!G82)","v":""},{"$f":"IF('Proposta Técnica'!H82=\"\",\"\",'Proposta Técnica'!H82)","v":""},0,""]
[null,null,{"$f":"IF('Proposta Técnica'!C83=\"\",\"\",'Proposta Técnica'!C83)","v":""},{"$f":"IF('Proposta Técnica'!D83=\"\",\"\",'Proposta Técnica'!D83)","v":""},{"$f":"IF('Proposta Técnica'!F83=\"\",\"\",'Proposta Técnica'!F83)","v":""},{"$f":"IF('Proposta Técnica'!G83=\"\",\"\",'Proposta Técnica'!G83)","v":""},{"$f":"IF('Proposta Técnica'!H83=\"\",\"\",'Proposta Técnica'!H83)","v":""},0,""]
[null,null,{"$f":"IF('Proposta Técnica'!C84=\"\",\"\",'Proposta Técnica'!C84)","v":""},{"$f":"IF('Proposta Técnica'!D84=\"\",\"\",'Proposta Técnica'!D84)","v":""},{"$f":"IF('Proposta Técnica'!F84=\"\",\"\",'Proposta Técnica'!F84)","v":""},{"$f":"IF('Proposta Técnica'!G84=\"\",\"\",'Proposta Técnica'!G84)","v":""},{"$f":"IF('Proposta Técnica'!H84=\"\",\"\",'Proposta Técnica'!H84)","v":""},0,""]
[null,null,{"$f":"IF('Proposta Técnica'!C85=\"\",\"\",'Proposta Técnica'!C85)","v":""},{"$f":"IF('Proposta Técnica'!D85=\"\",\"\",'Proposta Técnica'!D85)","v":""},{"$f":"IF('Proposta Técnica'!F85=\"\",\"\",'Proposta Técnica'!F85)","v":""},{"$f":"IF('Proposta Técnica'!G85=\"\",\"\",'Proposta Técnica'!G85)","v":""},{"$f":"IF('Proposta Técnica'!H85=\"\",\"\",'Proposta Técnica'!H85)","v":""},0,""]
[null,null,{"$f":"IF('Proposta Técnica'!C86=\"\",\"\",'Proposta Técnica'!C86)","v":""},{"$f":"IF('Proposta Técnica'!D86=\"\",\"\",'Proposta Técnica'!D86)","v":""},{"$f":"IF('Proposta Técnica'!F86=\"\",\"\",'Proposta Técnica'!F86)","v":""},{"$f":"IF('Proposta Técnica'!G86=\"\",\"\",'Proposta Técnica'!G86)","v":""},{"$f":"IF('Proposta Técnica'!H86=\"\",\"\",'Proposta Técnica'!H86)","v":""},0,""]
[null,null,{"$f":"IF('Proposta Técnica'!C87=\"\",\"\",'Proposta Técnica'!C87)","v":""},{"$f":"IF('Proposta Técnica'!D87=\"\",\"\",'Proposta Técnica'!D87)","v":""},{"$f":"IF('Proposta Técnica'!F87=\"\",\"\",'Proposta Técnica'!F87)","v":""},{"$f":"IF('Proposta Técnica'!G87=\"\",\"\",'Proposta Técnica'!G87)","v":""},{"$f":"IF('Proposta Técnica'!H87=\"\",\"\",'Proposta Técnica'!H87)","v":""},0,""]
[null,null,{"$f":"IF('Proposta Técnica'!C88=\"\",\"\",'Proposta Técnica'!C88)","v":""},{"$f":"IF('Proposta Técnica'!D88=\"\",\"\",'Proposta Técnica'!D88)","v":""},{"$f":"IF('Proposta Técnica'!F88=\"\",\"\",'Proposta Técnica'!F88)","v":""},{"$f":"IF('Proposta Técnica'!G88=\"\",\"\",'Proposta Técnica'!G88)","v":""},{"$f":"IF('Proposta Técnica'!H88=\"\",\"\",'Proposta Técnica'!H88)","v":""},0,""]
[null,null,{"$f":"IF('Proposta Técnica'!C89=\"\",\"\",'Proposta Técnica'!C89)","v":""},{"$f":"IF('Proposta Técnica'!D89=\"\",\"\",'Proposta Técnica'!D89)","v":""},{"$f":"IF('Proposta Técnica'!F89=\"\",\"\",'Proposta Técnica'!F89)","v":""},{"$f":"IF('Proposta Técnica'!G89=\"\",\"\",'Proposta Técnica'!G89)","v":""},{"$f":"IF('Proposta Técnica'!H89=\"\",\"\",'Proposta Técnica'!H89)","v":""},0,""]
[null,null,{"$f":"IF('Proposta Técnica'!C90=\"\",\"\",'Proposta Técnica'!C90)","v":""},{"$f":"IF('Proposta Técnica'!D90=\"\",\"\",'Proposta Técnica'!D90)","v":""},{"$f":"IF('Proposta Técnica'!F90=\"\",\"\",'Proposta Técnica'!F90)","v":""},{"$f":"IF('Proposta Técnica'!G90=\"\",\"\",'Proposta Técnica'!G90)","v":""},{"$f":"IF('Proposta Técnica'!H90=\"\",\"\",'Proposta Técnica'!H90)","v":""},0,""]
[null,null,{"$f":"IF('Proposta Técnica'!C91=\"\",\"\",'Proposta Técnica'!C91)","v":""},{"$f":"IF('Proposta Técnica'!D91=\"\",\"\",'Proposta Técnica'!D91)","v":""},{"$f":"IF('Proposta Técnica'!F91=\"\",\"\",'Proposta Técnica'!F91)","v":""},{"$f":"IF('Proposta Técnica'!G91=\"\",\"\",'Proposta Técnica'!G91)","v":""},{"$f":"IF('Proposta Técnica'!H91=\"\",\"\",'Proposta Técnica'!H91)","v":""},0,""]
[null,null,{"$f":"IF('Proposta Técnica'!C92=\"\",\"\",'Proposta Técnica'!C92)","v":""},{"$f":"IF('Proposta Técnica'!D92=\"\",\"\",'Proposta Técnica'!D92)","v":""},{"$f":"IF('Proposta Técnica'!F92=\"\",\"\",'Proposta Técnica'!F92)","v":""},{"$f":"IF('Proposta Técnica'!G92=\"\",\"\",'Proposta Técnica'!G92)","v":""},{"$f":"IF('Proposta Técnica'!H92=\"\",\"\",'Proposta Técnica'!H92)","v":""},0,""]
[null,null,{"$f":"IF('Proposta Técnica'!C93=\"\",\"\",'Proposta Técnica'!C93)","v":""},{"$f":"IF('Proposta Técnica'!D93=\"\",\"\",'Proposta Técnica'!D93)","v":""},{"$f":"IF('Proposta Técnica'!F93=\"\",\"\",'Proposta Técnica'!F93)","v":""},{"$f":"IF('Proposta Técnica'!G93=\"\",\"\",'Proposta Técnica'!G93)","v":""},{"$f":"IF('Proposta Técnica'!H93=\"\",\"\",'Proposta Técnica'!H93)","v":""},0,""]
[null,null,{"$f":"IF('Proposta Técnica'!C94=\"\",\"\",'Proposta Técnica'!C94)","v":""},{"$f":"IF('Proposta Técnica'!D94=\"\",\"\",'Proposta Técnica'!D94)","v":""},{"$f":"IF('Proposta Técnica'!F94=\"\",\"\",'Proposta Técnica'!F94)","v":""},{"$f":"IF('Proposta Técnica'!G94=\"\",\"\",'Proposta Técnica'!G94)","v":""},{"$f":"IF('Proposta Técnica'!H94=\"\",\"\",'Proposta Técnica'!H94)","v":""},0,""]
[null,null,{"$f":"IF('Proposta Técnica'!C95=\"\",\"\",'Proposta Técnica'!C95)","v":""},{"$f":"IF('Proposta Técnica'!D95=\"\",\"\",'Proposta Técnica'!D95)","v":""},{"$f":"IF('Proposta Técnica'!F95=\"\",\"\",'Proposta Técnica'!F95)","v":""},{"$f":"IF('Proposta Técnica'!G95=\"\",\"\",'Proposta Técnica'!G95)","v":""},{"$f":"IF('Proposta Técnica'!H95=\"\",\"\",'Proposta Técnica'!H95)","v":""},0,""]
[null,null,{"$f":"IF('Proposta Técnica'!C96=\"\",\"\",'Proposta Técnica'!C96)","v":""},{"$f":"IF('Proposta Técnica'!D96=\"\",\"\",'Proposta Técnica'!D96)","v":""},{"$f":"IF('Proposta Técnica'!F96=\"\",\"\",'Proposta Técnica'!F96)","v":""},{"$f":"IF('Proposta Técnica'!G96=\"\",\"\",'Proposta Técnica'!G96)","v":""},{"$f":"IF('Proposta Técnica'!H96=\"\",\"\",'Proposta Técnica'!H96)","v":""},0,""]
[null,null,{"$f":"IF('Proposta Técnica'!C97=\"\",\"\",'Proposta Técnica'!C97)","v":""},{"$f":"IF('Proposta Técnica'!D97=\"\",\"\",'Proposta Técnica'!D97)","v":""},{"$f":"IF('Proposta Técnica'!F97=\"\",\"\",'Proposta Técnica'!F97)","v":""},{"$f":"IF('Proposta Técnica'!G97=\"\",\"\",'Proposta Técnica'!G97)","v":""},{"$f":"IF('Proposta Técnica'!H97=\"\",\"\",'Proposta Técnica'!H97)","v":""},0,""]
[null,null,{"$f":"IF('Proposta Técnica'!C98=\"\",\"\",'Proposta Técnica'!C98)","v":""},{"$f":"IF('Proposta Técnica'!D98=\"\",\"\",'Proposta Técnica'!D98)","v":""},{"$f":"IF('Proposta Técnica'!F98=\"\",\"\",'Proposta Técnica'!F98)","v":""},{"$f":"IF('Proposta Técnica'!G98=\"\",\"\",'Proposta Técnica'!G98)","v":""},{"$f":"IF('Proposta Técnica'!H98=\"\",\"\",'Proposta Técnica'!H98)","v":""},0,""]
[null,null,{"$f":"IF('Proposta Técnica'!C99=\"\",\"\",'Proposta Técnica'!C99)","v":""},{"$f":"IF('Proposta Técnica'!D99=\"\",\"\",'Proposta Técnica'!D99)","v":""},{"$f":"IF('Proposta Técnica'!F99=\"\",\"\",'Proposta Técnica'!F99)","v":""},{"$f":"IF('Proposta Técnica'!G99=\"\",\"\",'Proposta Técnica'!G99)","v":""},{"$f":"IF('Proposta Técnica'!H99=\"\",\"\",'Proposta Técnica'!H99)","v":""},0,""]
[null,null,{"$f":"IF('Proposta Técnica'!C100=\"\",\"\",'Proposta Técnica'!C100)","v":""},{"$f":"IF('Proposta Técnica'!D100=\"\",\"\",'Proposta Técnica'!D100)","v":""},{"$f":"IF('Proposta Técnica'!F100=\"\",\"\",'Proposta Técnica'!F100)","v":""},{"$f":"IF('Proposta Técnica'!G100=\"\",\"\",'Proposta Técnica'!G100)","v":""},{"$f":"IF('Proposta Técnica'!H100=\"\",\"\",'Proposta Técnica'!H100)","v":""},0,""]
[null,null,{"$f":"IF('Proposta Técnica'!C101=\"\",\"\",'Proposta Técnica'!C101)","v":""},{"$f":"IF('Proposta Técnica'!D101=\"\",\"\",'Proposta Técnica'!D101)","v":""},{"$f":"IF('Proposta Técnica'!F101=\"\",\"\",'Proposta Técnica'!F101)","v":""},{"$f":"IF('Proposta Técnica'!G101=\"\",\"\",'Proposta Técnica'!G101)","v":""},{"$f":"IF('Proposta Técnica'!H101=\"\",\"\",'Proposta Técnica'!H101)","v":""},0,{"$f":"IFERROR(H77*E77,\"\")","v":""}]
[null,null,{"$f":"IF('Proposta Técnica'!C102=\"\",\"\",'Proposta Técnica'!C102)","v":""},{"$f":"IF('Proposta Técnica'!D102=\"\",\"\",'Proposta Técnica'!D102)","v":""},{"$f":"IF('Proposta Técnica'!F102=\"\",\"\",'Proposta Técnica'!F102)","v":""},{"$f":"IF('Proposta Técnica'!G102=\"\",\"\",'Proposta Técnica'!G102)","v":""},{"$f":"IF('Proposta Técnica'!H102=\"\",\"\",'Proposta Técnica'!H102)","v":""},0,""]
[null,null,{"$f":"IF('Proposta Técnica'!C103=\"\",\"\",'Proposta Técnica'!C103)","v":""},{"$f":"IF('Proposta Técnica'!D103=\"\",\"\",'Proposta Técnica'!D103)","v":""},{"$f":"IF('Proposta Técnica'!F103=\"\",\"\",'Proposta Técnica'!F103)","v":""},{"$f":"IF('Proposta Técnica'!G103=\"\",\"\",'Proposta Técnica'!G103)","v":""},{"$f":"IF('Proposta Técnica'!H103=\"\",\"\",'Proposta Técnica'!H103)","v":""},0,""]
[null,null,{"$f":"IF('Proposta Técnica'!C104=\"\",\"\",'Proposta Técnica'!C104)","v":""},{"$f":"IF('Proposta Técnica'!D104=\"\",\"\",'Proposta Técnica'!D104)","v":""},{"$f":"IF('Proposta Técnica'!F104=\"\",\"\",'Proposta Técnica'!F104)","v":""},{"$f":"IF('Proposta Técnica'!G104=\"\",\"\",'Proposta Técnica'!G104)","v":""},{"$f":"IF('Proposta Técnica'!H104=\"\",\"\",'Proposta Técnica'!H104)","v":""},0,""]
[null,null,{"$f":"IF('Proposta Técnica'!C105=\"\",\"\",'Proposta Técnica'!C105)","v":""},{"$f":"IF('Proposta Técnica'!D105=\"\",\"\",'Proposta Técnica'!D105)","v":""},{"$f":"IF('Proposta Técnica'!F105=\"\",\"\",'Proposta Técnica'!F105)","v":""},{"$f":"IF('Proposta Técnica'!G105=\"\",\"\",'Proposta Técnica'!G105)","v":""},{"$f":"IF('Proposta Técnica'!H105=\"\",\"\",'Proposta Técnica'!H105)","v":""},0,""]
[null,null,{"$f":"IF('Proposta Técnica'!C106=\"\",\"\",'Proposta Técnica'!C106)","v":""},{"$f":"IF('Proposta Técnica'!D106=\"\",\"\",'Proposta Técnica'!D106)","v":""},{"$f":"IF('Proposta Técnica'!F106=\"\",\"\",'Proposta Técnica'!F106)","v":""},{"$f":"IF('Proposta Técnica'!G106=\"\",\"\",'Proposta Técnica'!G106)","v":""},{"$f":"IF('Proposta Técnica'!H106=\"\",\"\",'Proposta Técnica'!H106)","v":""},0,""]
[null,null,{"$f":"IF('Proposta Técnica'!C107=\"\",\"\",'Proposta Técnica'!C107)","v":""},{"$f":"IF('Proposta Técnica'!D107=\"\",\"\",'Proposta Técnica'!D107)","v":""},{"$f":"IF('Proposta Técnica'!F107=\"\",\"\",'Proposta Técnica'!F107)","v":""},{"$f":"IF('Proposta Técnica'!G107=\"\",\"\",'Proposta Técnica'!G107)","v":""},{"$f":"IF('Proposta Técnica'!H107=\"\",\"\",'Proposta Técnica'!H107)","v":""},0,""]
[null,null,{"$f":"IF('Proposta Técnica'!C108=\"\",\"\",'Proposta Técnica'!C108)","v":""},{"$f":"IF('Proposta Técnica'!D108=\"\",\"\",'Proposta Técnica'!D108)","v":""},{"$f":"IF('Proposta Técnica'!F108=\"\",\"\",'Proposta Técnica'!F108)","v":""},{"$f":"IF('Proposta Técnica'!G108=\"\",\"\",'Proposta Técnica'!G108)","v":""},{"$f":"IF('Proposta Técnica'!H108=\"\",\"\",'Proposta Técnica'!H108)","v":""},0,""]
[null,null,{"$f":"IF('Proposta Técnica'!C109=\"\",\"\",'Proposta Técnica'!C109)","v":""},{"$f":"IF('Proposta Técnica'!D109=\"\",\"\",'Proposta Técnica'!D109)","v":""},{"$f":"IF('Proposta Técnica'!F109=\"\",\"\",'Proposta Técnica'!F109)","v":""},{"$f":"IF('Proposta Técnica'!G109=\"\",\"\",'Proposta Técnica'!G109)","v":""},{"$f":"IF('Proposta Técnica'!H109=\"\",\"\",'Proposta Técnica'!H109)","v":""},0,""]
[null,null,{"$f":"IF('Proposta Técnica'!C110=\"\",\"\",'Proposta Técnica'!C110)","v":""},{"$f":"IF('Proposta Técnica'!D110=\"\",\"\",'Proposta Técnica'!D110)","v":""},{"$f":"IF('Proposta Técnica'!F110=\"\",\"\",'Proposta Técnica'!F110)","v":""},{"$f":"IF('Proposta Técnica'!G110=\"\",\"\",'Proposta Técnica'!G110)","v":""},{"$f":"IF('Proposta Técnica'!H110=\"\",\"\",'Proposta Técnica'!H110)","v":""},0,""]
[null,null,{"$f":"IF('Proposta Técnica'!C111=\"\",\"\",'Proposta Técnica'!C111)","v":""},{"$f":"IF('Proposta Técnica'!D111=\"\",\"\",'Proposta Técnica'!D111)","v":""},{"$f":"IF('Proposta Técnica'!F111=\"\",\"\",'Proposta Técnica'!F111)","v":""},{"$f":"IF('Proposta Técnica'!G111=\"\",\"\",'Proposta Técnica'!G111)","v":""},{"$f":"IF('Proposta Técnica'!H111=\"\",\"\",'Proposta Técnica'!H111)","v":""},0,""]
[null,null,{"$f":"IF('Proposta Técnica'!C112=\"\",\"\",'Proposta Técnica'!C112)","v":""},{"$f":"IF('Proposta Técnica'!D112=\"\",\"\",'Proposta Técnica'!D112)","v":""},{"$f":"IF('Proposta Técnica'!F112=\"\",\"\",'Proposta Técnica'!F112)","v":""},{"$f":"IF('Proposta Técnica'!G112=\"\",\"\",'Proposta Técnica'!G112)","v":""},{"$f":"IF('Proposta Técnica'!H112=\"\",\"\",'Proposta Técnica'!H112)","v":""},0,""]
[null,null,{"$f":"IF('Proposta Técnica'!C113=\"\",\"\",'Proposta Técnica'!C113)","v":""},{"$f":"IF('Proposta Técnica'!D113=\"\",\"\",'Proposta Técnica'!D113)","v":""},{"$f":"IF('Proposta Técnica'!F113=\"\",\"\",'Proposta Técnica'!F113)","v":""},{"$f":"IF('Proposta Técnica'!G113=\"\",\"\",'Proposta Técnica'!G113)","v":""},{"$f":"IF('Proposta Técnica'!H113=\"\",\"\",'Proposta Técnica'!H113)","v":""},0,""]
[null,null,{"$f":"IF('Proposta Técnica'!C114=\"\",\"\",'Proposta Técnica'!C114)","v":""},{"$f":"IF('Proposta Técnica'!D114=\"\",\"\",'Proposta Técnica'!D114)","v":""},{"$f":"IF('Proposta Técnica'!F114=\"\",\"\",'Proposta Técnica'!F114)","v":""},{"$f":"IF('Proposta Técnica'!G114=\"\",\"\",'Proposta Técnica'!G114)","v":""},{"$f":"IF('Proposta Técnica'!H114=\"\",\"\",'Proposta Técnica'!H114)","v":""},0,""]
[null,null,{"$f":"IF('Proposta Técnica'!C115=\"\",\"\",'Proposta Técnica'!C115)","v":""},{"$f":"IF('Proposta Técnica'!D115=\"\",\"\",'Proposta Técnica'!D115)","v":""},{"$f":"IF('Proposta Técnica'!F115=\"\",\"\",'Proposta Técnica'!F115)","v":""},{"$f":"IF('Proposta Técnica'!G115=\"\",\"\",'Proposta Técnica'!G115)","v":""},{"$f":"IF('Proposta Técnica'!H115=\"\",\"\",'Proposta Técnica'!H115)","v":""},0,""]
[null,null,{"$f":"IF('Proposta Técnica'!C116=\"\",\"\",'Proposta Técnica'!C116)","v":""},{"$f":"IF('Proposta Técnica'!D116=\"\",\"\",'Proposta Técnica'!D116)","v":""},{"$f":"IF('Proposta Técnica'!F116=\"\",\"\",'Proposta Técnica'!F116)","v":""},{"$f":"IF('Proposta Técnica'!G116=\"\",\"\",'Proposta Técnica'!G116)","v":""},{"$f":"IF('Proposta Técnica'!H116=\"\",\"\",'Proposta Técnica'!H116)","v":""},0,""]
[null,null,{"$f":"IF('Proposta Técnica'!C117=\"\",\"\",'Proposta Técnica'!C117)","v":""},{"$f":"IF('Proposta Técnica'!D117=\"\",\"\",'Proposta Técnica'!D117)","v":""},{"$f":"IF('Proposta Técnica'!F117=\"\",\"\",'Proposta Técnica'!F117)","v":""},{"$f":"IF('Proposta Técnica'!G117=\"\",\"\",'Proposta Técnica'!G117)","v":""},{"$f":"IF('Proposta Técnica'!H117=\"\",\"\",'Proposta Técnica'!H117)","v":""},0,""]
[null,null,{"$f":"IF('Proposta Técnica'!C118=\"\",\"\",'Proposta Técnica'!C118)","v":""},{"$f":"IF('Proposta Técnica'!D118=\"\",\"\",'Proposta Técnica'!D118)","v":""},{"$f":"IF('Proposta Técnica'!F118=\"\",\"\",'Proposta Técnica'!F118)","v":""},{"$f":"IF('Proposta Técnica'!G118=\"\",\"\",'Proposta Técnica'!G118)","v":""},{"$f":"IF('Proposta Técnica'!H118=\"\",\"\",'Proposta Técnica'!H118)","v":""},0,""]
[null,null,{"$f":"IF('Proposta Técnica'!C119=\"\",\"\",'Proposta Técnica'!C119)","v":""},{"$f":"IF('Proposta Técnica'!D119=\"\",\"\",'Proposta Técnica'!D119)","v":""},{"$f":"IF('Proposta Técnica'!F119=\"\",\"\",'Proposta Técnica'!F119)","v":""},{"$f":"IF('Proposta Técnica'!G119=\"\",\"\",'Proposta Técnica'!G119)","v":""},{"$f":"IF('Proposta Técnica'!H119=\"\",\"\",'Proposta Técnica'!H119)","v":""},0,""]
[null,null,{"$f":"IF('Proposta Técnica'!C120=\"\",\"\",'Proposta Técnica'!C120)","v":""},{"$f":"IF('Proposta Técnica'!D120=\"\",\"\",'Proposta Técnica'!D120)","v":""},{"$f":"IF('Proposta Técnica'!F120=\"\",\"\",'Proposta Técnica'!F120)","v":""},{"$f":"IF('Proposta Técnica'!G120=\"\",\"\",'Proposta Técnica'!G120)","v":""},{"$f":"IF('Proposta Técnica'!H120=\"\",\"\",'Proposta Técnica'!H120)","v":""},0,""]
[null,null,{"$f":"IF('Proposta Técnica'!C121=\"\",\"\",'Proposta Técnica'!C121)","v":""},{"$f":"IF('Proposta Técnica'!D121=\"\",\"\",'Proposta Técnica'!D121)","v":""},{"$f":"IF('Proposta Técnica'!F121=\"\",\"\",'Proposta Técnica'!F121)","v":""},{"$f":"IF('Proposta Técnica'!G121=\"\",\"\",'Proposta Técnica'!G121)","v":""},{"$f":"IF('Proposta Técnica'!H121=\"\",\"\",'Proposta Técnica'!H121)","v":""},0,""]
[null,null,{"$f":"IF('Proposta Técnica'!C122=\"\",\"\",'Proposta Técnica'!C122)","v":""},{"$f":"IF('Proposta Técnica'!D122=\"\",\"\",'Proposta Técnica'!D122)","v":""},{"$f":"IF('Proposta Técnica'!F122=\"\",\"\",'Proposta Técnica'!F122)","v":""},{"$f":"IF('Proposta Técnica'!G122=\"\",\"\",'Proposta Técnica'!G122)","v":""},{"$f":"IF('Proposta Técnica'!H122=\"\",\"\",'Proposta Técnica'!H122)","v":""},0,""]
[null,null,{"$f":"IF('Proposta Técnica'!C123=\"\",\"\",'Proposta Técnica'!C123)","v":""},{"$f":"IF('Proposta Técnica'!D123=\"\",\"\",'Proposta Técnica'!D123)","v":""},{"$f":"IF('Proposta Técnica'!F123=\"\",\"\",'Proposta Técnica'!F123)","v":""},{"$f":"IF('Proposta Técnica'!G123=\"\",\"\",'Proposta Técnica'!G123)","v":""},{"$f":"IF('Proposta Técnica'!H123=\"\",\"\",'Proposta Técnica'!H123)","v":""},0,""]
[null,null,{"$f":"IF('Proposta Técnica'!C124=\"\",\"\",'Proposta Técnica'!C124)","v":""},{"$f":"IF('Proposta Técnica'!D124=\"\",\"\",'Proposta Técnica'!D124)","v":""},{"$f":"IF('Proposta Técnica'!F124=\"\",\"\",'Proposta Técnica'!F124)","v":""},{"$f":"IF('Proposta Técnica'!G124=\"\",\"\",'Proposta Técnica'!G124)","v":""},{"$f":"IF('Proposta Técnica'!H124=\"\",\"\",'Proposta Técnica'!H124)","v":""},0,""]
[null,null,{"$f":"IF('Proposta Técnica'!C125=\"\",\"\",'Proposta Técnica'!C125)","v":""},{"$f":"IF('Proposta Técnica'!D125=\"\",\"\",'Proposta Técnica'!D125)","v":""},{"$f":"IF('Proposta Técnica'!F125=\"\",\"\",'Proposta Técnica'!F125)","v":""},{"$f":"IF('Proposta Técnica'!G125=\"\",\"\",'Proposta Técnica'!G125)","v":""},{"$f":"IF('Proposta Técnica'!H125=\"\",\"\",'Proposta Técnica'!H125)","v":""},0,""]
[null,null,{"$f":"IF('Proposta Técnica'!C126=\"\",\"\",'Proposta Técnica'!C126)","v":""},{"$f":"IF('Proposta Técnica'!D126=\"\",\"\",'Proposta Técnica'!D126)","v":""},{"$f":"IF('Proposta Técnica'!F126=\"\",\"\",'Proposta Técnica'!F126)","v":""},{"$f":"IF('Proposta Técnica'!G126=\"\",\"\",'Proposta Técnica'!G126)","v":""},{"$f":"IF('Proposta Técnica'!H126=\"\",\"\",'Proposta Técnica'!H126)","v":""},0,""]
[null,null,{"$f":"IF('Proposta Técnica'!C127=\"\",\"\",'Proposta Técnica'!C127)","v":""},{"$f":"IF('Proposta Técnica'!D127=\"\",\"\",'Proposta Técnica'!D127)","v":""},{"$f":"IF('Proposta Técnica'!F127=\"\",\"\",'Proposta Técnica'!F127)","v":""},{"$f":"IF('Proposta Técnica'!G127=\"\",\"\",'Proposta Técnica'!G127)","v":""},{"$f":"IF('Proposta Técnica'!H127=\"\",\"\",'Proposta Técnica'!H127)","v":""},0,""]
[null,null,{"$f":"IF('Proposta Técnica'!C128=\"\",\"\",'Proposta Técnica'!C128)","v":""},{"$f":"IF('Proposta Técnica'!D128=\"\",\"\",'Proposta Técnica'!D128)","v":""},{"$f":"IF('Proposta Técnica'!F128=\"\",\"\",'Proposta Técnica'!F128)","v":""},{"$f":"IF('Proposta Técnica'!G128=\"\",\"\",'Proposta Técnica'!G128)","v":""},{"$f":"IF('Proposta Técnica'!H128=\"\",\"\",'Proposta Técnica'!H128)","v":""},0,""]
[null,null,{"$f":"IF('Proposta Técnica'!C129=\"\",\"\",'Proposta Técnica'!C129)","v":""},{"$f":"IF('Proposta Técnica'!D129=\"\",\"\",'Proposta Técnica'!D129)","v":""},{"$f":"IF('Proposta Técnica'!F129=\"\",\"\",'Proposta Técnica'!F129)","v":""},{"$f":"IF('Proposta Técnica'!G129=\"\",\"\",'Proposta Técnica'!G129)","v":""},{"$f":"IF('Proposta Técnica'!H129=\"\",\"\",'Proposta Técnica'!H129)","v":""},0,""]
[null,null,{"$f":"IF('Proposta Técnica'!C130=\"\",\"\",'Proposta Técnica'!C130)","v":""},{"$f":"IF('Proposta Técnica'!D130=\"\",\"\",'Proposta Técnica'!D130)","v":""},{"$f":"IF('Proposta Técnica'!F130=\"\",\"\",'Proposta Técnica'!F130)","v":""},{"$f":"IF('Proposta Técnica'!G130=\"\",\"\",'Proposta Técnica'!G130)","v":""},{"$f":"IF('Proposta Técnica'!H130=\"\",\"\",'Proposta Técnica'!H130)","v":""},0,""]
[null,null,{"$f":"IF('Proposta Técnica'!C131=\"\",\"\",'Proposta Técnica'!C131)","v":""},{"$f":"IF('Proposta Técnica'!D131=\"\",\"\",'Proposta Técnica'!D131)","v":""},{"$f":"IF('Proposta Técnica'!F131=\"\",\"\",'Proposta Técnica'!F131)","v":""},{"$f":"IF('Proposta Técnica'!G131=\"\",\"\",'Proposta Técnica'!G131)","v":""},{"$f":"IF('Proposta Técnica'!H131=\"\",\"\",'Proposta Técnica'!H131)","v":""},0,""]
[null,null,{"$f":"IF('Proposta Técnica'!C132=\"\",\"\",'Proposta Técnica'!C132)","v":""},{"$f":"IF('Proposta Técnica'!D132=\"\",\"\",'Proposta Técnica'!D132)","v":""},{"$f":"IF('Proposta Técnica'!F132=\"\",\"\",'Proposta Técnica'!F132)","v":""},{"$f":"IF('Proposta Técnica'!G132=\"\",\"\",'Proposta Técnica'!G132)","v":""},{"$f":"IF('Proposta Técnica'!H132=\"\",\"\",'Proposta Técnica'!H132)","v":""},0,""]
[null,null,{"$f":"IF('Proposta Técnica'!C133=\"\",\"\",'Proposta Técnica'!C133)","v":""},{"$f":"IF('Proposta Técnica'!D133=\"\",\"\",'Proposta Técnica'!D133)","v":""},{"$f":"IF('Proposta Técnica'!F133=\"\",\"\",'Proposta Técnica'!F133)","v":""},{"$f":"IF('Proposta Técnica'!G133=\"\",\"\",'Proposta Técnica'!G133)","v":""},{"$f":"IF('Proposta Técnica'!H133=\"\",\"\",'Proposta Técnica'!H133)","v":""},0,""]
[null,null,{"$f":"IF('Proposta Técnica'!C134=\"\",\"\",'Proposta Técnica'!C134)","v":""},{"$f":"IF('Proposta Técnica'!D134=\"\",\"\",'Proposta Técnica'!D134)","v":""},{"$f":"IF('Proposta Técnica'!F134=\"\",\"\",'Proposta Técnica'!F134)","v":""},{"$f":"IF('Proposta Técnica'!G134=\"\",\"\",'Proposta Técnica'!G134)","v":""},{"$f":"IF('Proposta Técnica'!H134=\"\",\"\",'Proposta Técnica'!H134)","v":""},0,""]
[null,null,{"$f":"IF('Proposta Técnica'!C135=\"\",\"\",'Proposta Técnica'!C135)","v":""},{"$f":"IF('Proposta Técnica'!D135=\"\",\"\",'Proposta Técnica'!D135)","v":""},{"$f":"IF('Proposta Técnica'!F135=\"\",\"\",'Proposta Técnica'!F135)","v":""},{"$f":"IF('Proposta Técnica'!G135=\"\",\"\",'Proposta Técnica'!G135)","v":""},{"$f":"IF('Proposta Técnica'!H135=\"\",\"\",'Proposta Técnica'!H135)","v":""},0,""]

{"sheet":"MEMÓRIA DE CÁLCULO","index":3,"n_rows":31,"n_cols":6,"rows_kept":31,"cut":false,"hidden":false,"merged":[[30,0,30,4]]}
["Item","Descrição Atividade/Produto","Qtde.","Unid. Medida","Valor Unitário (Bruto)","Valor Total (Bruto)"]
[]
[]
[]
[]
[]
[]
[]
[]
[]
[]
[]
[]
[]
[]
[]
[]
[]
[]
[]
[]
[]
[]
[]
[]
[]
[]
[]
[]
[]
["TOTAL",null,null,null,null,{"$f":"SUM(F2:F30)","v":0}]

{"sheet":"TDR Técnica","index":4,"n_rows":119,"n_cols":6,"rows_kept":119,"cut":false,"hidden":true,"merged":[[116,2,116,3],[117,2,117,3],[118,2,118,3],[17,0,17,4],[111,2,111,3],[112,2,112,3],[113,2,113,3],[114,2,114,3],[115,2,115,3],[106,2,106,3],[107,2,107,3],[108,2,108,3],[109,2,109,3],[110,2,110,3],[101,2,101,3],[102,2,102,3],[103,2,103,3],[104,2,104,3],[105,2,105,3],[96,2,96,3],[97,2,97,3],[98,2,98,3],[99,2,99,3],[100,2,100,3],[91,2,91,3],[92,2,92,3],[93,2,93,3],[94,2,94,3],[95,2,95,3],[86,2,86,3],[87,2,87,3],[88,2,88,3],[89,2,89,3],[90,2,90,3],[81,2,81,3],[82,2,82,3],[83,2,83,3],[84,2,84,3],[85,2,85,3],[76,2,76,3],[77,2,77,3],[78,2,78,3],[79,2,79,3],[80,2,80,3],[71,2,71,3],[72,2,72,3],[73,2,73,3],[74,2,74,3],[75,2,75,3],[66,2,66,3],[67,2,67,3],[68,2,68,3],[69,2,69,3],[70,2,70,3],[61,2,61,3],[62,2,62,3],[63,2,63,3],[64,2,64,3],[65,2,65,3],[56,2,56,3],[57,2,57,3],[58,2,58,3],[59,2,59,3],[60,2,60,3],[51,2,51,3],[52,2,52,3],[53,2,53,3],[54,2,54,3],[55,2,55,3],[46,2,46,3],[47,2,47,3],[48,2,48,3],[49,2,49,3],[50,2,50,3],[41,2,41,3],[42,2,42,3],[43,2,43,3],[44,2,44,3],[45,2,45,3],[36,2,36,3],[37,2,37,3],[38,2,38,3],[39,2,39,3],[40,2,40,3],[31,2,31,3],[32,2,32,3],[33,2,33,3],[34,2,34,3],[35,2,35,3],[26,2,26,3],[27,2,27,3],[28,2,28,3],[29,2,29,3],[30,2,30,3],[21,2,21,3],[22,2,22,3],[23,2,23,3],[24,2,24,3],[25,2,25,3],[3,0,3,5],[18,2,18,3],[19,2,19,3],[20,2,20,3]]}
[]
[]
[]
["Composição da Equipe e Atribuição de Responsabilidades"]
["Nome","Cargo/Área de Especialidade","Responsabilidade","Telefone","Email","Empresa"]
[{"$f":"IF('Proposta Técnica'!C9=\"\",\"\",'Proposta Técnica'!C9)","v":""},{"$f":"IF('Proposta Técnica'!D9=\"\",\"\",'Proposta Técnica'!D9)","v":""},{"$f":"IF('Proposta Técnica'!E9=\"\",\"\",'Proposta Técnica'!E9)","v":""},{"$f":"IF('Proposta Técnica'!H9=\"\",\"\",'Proposta Técnica'!H9)","v":""},{"$f":"IF('Proposta Técnica'!I9=\"\",\"\",'Proposta Técnica'!I9)","v":""},{"$f":"IF(E6=\"\",\"\",'Proposta Técnica'!$D$3)","v":""}]
[{"$f":"IF('Proposta Técnica'!C10=\"\",\"\",'Proposta Técnica'!C10)","v":""},{"$f":"IF('Proposta Técnica'!D10=\"\",\"\",'Proposta Técnica'!D10)","v":""},{"$f":"IF('Proposta Técnica'!E10=\"\",\"\",'Proposta Técnica'!E10)","v":""},{"$f":"IF('Proposta Técnica'!H10=\"\",\"\",'Proposta Técnica'!H10)","v":""},{"$f":"IF('Proposta Técnica'!I10=\"\",\"\",'Proposta Técnica'!I10)","v":""},{"$f":"IF(E7=\"\",\"\",'Proposta Técnica'!$D$3)","v":""}]
[{"$f":"IF('Proposta Técnica'!C11=\"\",\"\",'Proposta Técnica'!C11)","v":""},{"$f":"IF('Proposta Técnica'!D11=\"\",\"\",'Proposta Técnica'!D11)","v":""},{"$f":"IF('Proposta Técnica'!E11=\"\",\"\",'Proposta Técnica'!E11)","v":""},{"$f":"IF('Proposta Técnica'!H11=\"\",\"\",'Proposta Técnica'!H11)","v":""},{"$f":"IF('Proposta Técnica'!I11=\"\",\"\",'Proposta Técnica'!I11)","v":""},{"$f":"IF(E8=\"\",\"\",'Proposta Técnica'!$D$3)","v":""}]
[{"$f":"IF('Proposta Técnica'!C12=\"\",\"\",'Proposta Técnica'!C12)","v":""},{"$f":"IF('Proposta Técnica'!D12=\"\",\"\",'Proposta Técnica'!D12)","v":""},{"$f":"IF('Proposta Técnica'!E12=\"\",\"\",'Proposta Técnica'!E12)","v":""},{"$f":"IF('Proposta Técnica'!H12=\"\",\"\",'Proposta Técnica'!H12)","v":""},{"$f":"IF('Proposta Técnica'!I12=\"\",\"\",'Proposta Técnica'!I12)","v":""},{"$f":"IF(E9=\"\",\"\",'Proposta Técnica'!$D$3)","v":""}]
[{"$f":"IF('Proposta Técnica'!C13=\"\",\"\",'Proposta Técnica'!C13)","v":""},{"$f":"IF('Proposta Técnica'!D13=\"\",\"\",'Proposta Técnica'!D13)","v":""},{"$f":"IF('Proposta Técnica'!E13=\"\",\"\",'Proposta Técnica'!E13)","v":""},{"$f":"IF('Proposta Técnica'!H13=\"\",\"\",'Proposta Técnica'!H13)","v":""},{"$f":"IF('Proposta Técnica'!I13=\"\",\"\",'Proposta Técnica'!I13)","v":""},{"$f":"IF(E10=\"\",\"\",'Proposta Técnica'!$D$3)","v":""}]
[{"$f":"IF('Proposta Técnica'!C14=\"\",\"\",'Proposta Técnica'!C14)","v":""},{"$f":"IF('Proposta Técnica'!D14=\"\",\"\",'Proposta Técnica'!D14)","v":""},{"$f":"IF('Proposta Técnica'!E14=\"\",\"\",'Proposta Técnica'!E14)","v":""},{"$f":"IF('Proposta Técnica'!H14=\"\",\"\",'Proposta Técnica'!H14)","v":""},{"$f":"IF('Proposta Técnica'!I14=\"\",\"\",'Proposta Técnica'!I14)","v":""},{"$f":"IF(E11=\"\",\"\",'Proposta Técnica'!$D$3)","v":""}]
[{"$f":"IF('Proposta Técnica'!C15=\"\",\"\",'Proposta Técnica'!C15)","v":""},{"$f":"IF('Proposta Técnica'!D15=\"\",\"\",'Proposta Técnica'!D15)","v":""},{"$f":"IF('Proposta Técnica'!E15=\"\",\"\",'Proposta Técnica'!E15)","v":""},{"$f":"IF('Proposta Técnica'!H15=\"\",\"\",'Proposta Técnica'!H15)","v":""},{"$f":"IF('Proposta Técnica'!I15=\"\",\"\",'Proposta Técnica'!I15)","v":""},{"$f":"IF(E12=\"\",\"\",'Proposta Técnica'!$D$3)","v":""}]
[{"$f":"IF('Proposta Técnica'!C16=\"\",\"\",'Proposta Técnica'!C16)","v":""},{"$f":"IF('Proposta Técnica'!D16=\"\",\"\",'Proposta Técnica'!D16)","v":""},{"$f":"IF('Proposta Técnica'!E16=\"\",\"\",'Proposta Técnica'!E16)","v":""},{"$f":"IF('Proposta Técnica'!H16=\"\",\"\",'Proposta Técnica'!H16)","v":""},{"$f":"IF('Proposta Técnica'!I16=\"\",\"\",'Proposta Técnica'!I16)","v":""},{"$f":"IF(E13=\"\",\"\",'Proposta Técnica'!$D$3)","v":""}]
[{"$f":"IF('Proposta Técnica'!C17=\"\",\"\",'Proposta Técnica'!C17)","v":""},{"$f":"IF('Proposta Técnica'!D17=\"\",\"\",'Proposta Técnica'!D17)","v":""},{"$f":"IF('Proposta Técnica'!E17=\"\",\"\",'Proposta Técnica'!E17)","v":""},{"$f":"IF('Proposta Técnica'!H17=\"\",\"\",'Proposta Técnica'!H17)","v":""},{"$f":"IF('Proposta Técnica'!I17=\"\",\"\",'Proposta Técnica'!I17)","v":""},{"$f":"IF(E14=\"\",\"\",'Proposta Técnica'!$D$3)","v":""}]
[{"$f":"IF('Proposta Técnica'!C18=\"\",\"\",'Proposta Técnica'!C18)","v":""},{"$f":"IF('Proposta Técnica'!D18=\"\",\"\",'Proposta Técnica'!D18)","v":""},{"$f":"IF('Proposta Técnica'!E18=\"\",\"\",'Proposta Técnica'!E18)","v":""},{"$f":"IF('Proposta Técnica'!H18=\"\",\"\",'Proposta Técnica'!H18)","v":""},{"$f":"IF('Proposta Técnica'!I18=\"\",\"\",'Proposta Técnica'!I18)","v":""},{"$f":"IF(E15=\"\",\"\",'Proposta Técnica'!$D$3)","v":""}]
[{"$f":"IF('Proposta Técnica'!C19=\"\",\"\",'Proposta Técnica'!C19)","v":""},{"$f":"IF('Proposta Técnica'!D19=\"\",\"\",'Proposta Técnica'!D19)","v":""},{"$f":"IF('Proposta Técnica'!E19=\"\",\"\",'Proposta Técnica'!E19)","v":""},{"$f":"IF('Proposta Técnica'!H19=\"\",\"\",'Proposta Técnica'!H19)","v":""},{"$f":"IF('Proposta Técnica'!I19=\"\",\"\",'Proposta Técnica'!I19)","v":""},{"$f":"IF(E16=\"\",\"\",'Proposta Técnica'!$D$3)","v":""}]
[]
["PROPOSTA TÉCNICA"]
["Item","Produto/Entregável","Atividade / Plano de Trabalho",null,"Prazo de Entrega Após Assinatura do Contrato"]
[{"$f":"IF('Proposta Técnica'!C36=\"\",\"\",'Proposta Técnica'!C36)","v":1},{"$f":"IF('Proposta Técnica'!D36=\"\",\"\",'Proposta Técnica'!D36)","v":"Plano de trabalho e cronograma detalhados, com a abordagem metodológica proposta para a execução do componente institucional e de governança do diagnóstico"},{"$f":"IF('Proposta Técnica'!E36=\"\",\"\",'Proposta Técnica'!E36)","v":""},null,{"$f":"IF('Proposta Técnica'!H36=\"\",\"\",'Proposta Técnica'!H36)","v":"15 dias"}]
[{"$f":"IF('Proposta Técnica'!C37=\"\",\"\",'Proposta Técnica'!C37)","v":2},{"$f":"IF('Proposta Técnica'!D37=\"\",\"\",'Proposta Técnica'!D37)","v":"Relatório preliminar de mapeamento de políticas, marcos legais e arranjos institucionais; e de mapeamento de atores-chave (órgãos governamentais, instituições de pesquisa, organizações não governamentais e parceiros regionais)."},{"$f":"IF('Proposta Técnica'!E37=\"\",\"\",'Proposta Técnica'!E37)","v":""},null,{"$f":"IF('Proposta Técnica'!H37=\"\",\"\",'Proposta Técnica'!H37)","v":"60 dias"}]
[{"$f":"IF('Proposta Técnica'!C38=\"\",\"\",'Proposta Técnica'!C38)","v":3},{"$f":"IF('Proposta Técnica'!D38=\"\",\"\",'Proposta Técnica'!D38)","v":"Relatório de analise das políticas, marcos legais e arranjos institucionais — nacionais e internacionais — para relevantes para a proteção de baleias e seus corredores ecológicos no Brasil e na região do Atlântico Sul, com análise das oportunidades de avanço para agenda e de alinhamento da Iniciativa Corredores Azuis com processos da CMS, IWC e da ZOPACAS."},{"$f":"IF('Proposta Técnica'!E38=\"\",\"\",'Proposta Técnica'!E38)","v":""},null,{"$f":"IF('Proposta Técnica'!H38=\"\",\"\",'Proposta Técnica'!H38)","v":"153 dias"}]
[{"$f":"IF('Proposta Técnica'!C39=\"\",\"\",'Proposta Técnica'!C39)","v":4},{"$f":"IF('Proposta Técnica'!D39=\"\",\"\",'Proposta Técnica'!D39)","v":"Relatório preliminar de mapeamento de atores-chave (órgãos governamentais, instituições de pesquisa, organizações não governamentais e parceiros regionais) pós-eleições, com análise de seus papéis, interesse e poder em relação à conservação de cetáceos e à governança de corredores azuis."},{"$f":"IF('Proposta Técnica'!E39=\"\",\"\",'Proposta Técnica'!E39)","v":""},null,{"$f":"IF('Proposta Técnica'!H39=\"\",\"\",'Proposta Técnica'!H39)","v":"153 dias"}]
[{"$f":"IF('Proposta Técnica'!C40=\"\",\"\",'Proposta Técnica'!C40)","v":5},{"$f":"IF('Proposta Técnica'!D40=\"\",\"\",'Proposta Técnica'!D40)","v":"Versão final consolidada dos relatórios institucional e de governança, com insumos do Workshop de Corredores Azuis do Atlântico Sul"},{"$f":"IF('Proposta Técnica'!E40=\"\",\"\",'Proposta Técnica'!E40)","v":""},null,{"$f":"IF('Proposta Técnica'!H40=\"\",\"\",'Proposta Técnica'!H40)","v":"195 dias"}]
[{"$f":"IF('Proposta Técnica'!C41=\"\",\"\",'Proposta Técnica'!C41)","v":""},{"$f":"IF('Proposta Técnica'!D41=\"\",\"\",'Proposta Técnica'!D41)","v":""},{"$f":"IF('Proposta Técnica'!E41=\"\",\"\",'Proposta Técnica'!E41)","v":""},null,{"$f":"IF('Proposta Técnica'!H41=\"\",\"\",'Proposta Técnica'!H41)","v":""}]
[{"$f":"IF('Proposta Técnica'!C42=\"\",\"\",'Proposta Técnica'!C42)","v":""},{"$f":"IF('Proposta Técnica'!D42=\"\",\"\",'Proposta Técnica'!D42)","v":""},{"$f":"IF('Proposta Técnica'!E42=\"\",\"\",'Proposta Técnica'!E42)","v":""},null,{"$f":"IF('Proposta Técnica'!H42=\"\",\"\",'Proposta Técnica'!H42)","v":""}]
[{"$f":"IF('Proposta Técnica'!C43=\"\",\"\",'Proposta Técnica'!C43)","v":""},{"$f":"IF('Proposta Técnica'!D43=\"\",\"\",'Proposta Técnica'!D43)","v":""},{"$f":"IF('Proposta Técnica'!E43=\"\",\"\",'Proposta Técnica'!E43)","v":""},null,{"$f":"IF('Proposta Técnica'!H43=\"\",\"\",'Proposta Técnica'!H43)","v":""}]
[{"$f":"IF('Proposta Técnica'!C44=\"\",\"\",'Proposta Técnica'!C44)","v":""},{"$f":"IF('Proposta Técnica'!D44=\"\",\"\",'Proposta Técnica'!D44)","v":""},{"$f":"IF('Proposta Técnica'!E44=\"\",\"\",'Proposta Técnica'!E44)","v":""},null,{"$f":"IF('Proposta Técnica'!H44=\"\",\"\",'Proposta Técnica'!H44)","v":""}]
[{"$f":"IF('Proposta Técnica'!C45=\"\",\"\",'Proposta Técnica'!C45)","v":""},{"$f":"IF('Proposta Técnica'!D45=\"\",\"\",'Proposta Técnica'!D45)","v":""},{"$f":"IF('Proposta Técnica'!E45=\"\",\"\",'Proposta Técnica'!E45)","v":""},null,{"$f":"IF('Proposta Técnica'!H45=\"\",\"\",'Proposta Técnica'!H45)","v":""}]
[{"$f":"IF('Proposta Técnica'!C46=\"\",\"\",'Proposta Técnica'!C46)","v":""},{"$f":"IF('Proposta Técnica'!D46=\"\",\"\",'Proposta Técnica'!D46)","v":""},{"$f":"IF('Proposta Técnica'!E46=\"\",\"\",'Proposta Técnica'!E46)","v":""},null,{"$f":"IF('Proposta Técnica'!H46=\"\",\"\",'Proposta Técnica'!H46)","v":""}]
[{"$f":"IF('Proposta Técnica'!C47=\"\",\"\",'Proposta Técnica'!C47)","v":""},{"$f":"IF('Proposta Técnica'!D47=\"\",\"\",'Proposta Técnica'!D47)","v":""},{"$f":"IF('Proposta Técnica'!E47=\"\",\"\",'Proposta Técnica'!E47)","v":""},null,{"$f":"IF('Proposta Técnica'!H47=\"\",\"\",'Proposta Técnica'!H47)","v":""}]
[{"$f":"IF('Proposta Técnica'!C48=\"\",\"\",'Proposta Técnica'!C48)","v":""},{"$f":"IF('Proposta Técnica'!D48=\"\",\"\",'Proposta Técnica'!D48)","v":""},{"$f":"IF('Proposta Técnica'!E48=\"\",\"\",'Proposta Técnica'!E48)","v":""},null,{"$f":"IF('Proposta Técnica'!H48=\"\",\"\",'Proposta Técnica'!H48)","v":""}]
[{"$f":"IF('Proposta Técnica'!C49=\"\",\"\",'Proposta Técnica'!C49)","v":""},{"$f":"IF('Proposta Técnica'!D49=\"\",\"\",'Proposta Técnica'!D49)","v":""},{"$f":"IF('Proposta Técnica'!E49=\"\",\"\",'Proposta Técnica'!E49)","v":""},null,{"$f":"IF('Proposta Técnica'!H49=\"\",\"\",'Proposta Técnica'!H49)","v":""}]
[{"$f":"IF('Proposta Técnica'!C50=\"\",\"\",'Proposta Técnica'!C50)","v":""},{"$f":"IF('Proposta Técnica'!D50=\"\",\"\",'Proposta Técnica'!D50)","v":""},{"$f":"IF('Proposta Técnica'!E50=\"\",\"\",'Proposta Técnica'!E50)","v":""},null,{"$f":"IF('Proposta Técnica'!H50=\"\",\"\",'Proposta Técnica'!H50)","v":""}]
[{"$f":"IF('Proposta Técnica'!C51=\"\",\"\",'Proposta Técnica'!C51)","v":""},{"$f":"IF('Proposta Técnica'!D51=\"\",\"\",'Proposta Técnica'!D51)","v":""},{"$f":"IF('Proposta Técnica'!E51=\"\",\"\",'Proposta Técnica'!E51)","v":""},null,{"$f":"IF('Proposta Técnica'!H51=\"\",\"\",'Proposta Técnica'!H51)","v":""}]
[{"$f":"IF('Proposta Técnica'!C52=\"\",\"\",'Proposta Técnica'!C52)","v":""},{"$f":"IF('Proposta Técnica'!D52=\"\",\"\",'Proposta Técnica'!D52)","v":""},{"$f":"IF('Proposta Técnica'!E52=\"\",\"\",'Proposta Técnica'!E52)","v":""},null,{"$f":"IF('Proposta Técnica'!H52=\"\",\"\",'Proposta Técnica'!H52)","v":""}]
[{"$f":"IF('Proposta Técnica'!C53=\"\",\"\",'Proposta Técnica'!C53)","v":""},{"$f":"IF('Proposta Técnica'!D53=\"\",\"\",'Proposta Técnica'!D53)","v":""},{"$f":"IF('Proposta Técnica'!E53=\"\",\"\",'Proposta Técnica'!E53)","v":""},null,{"$f":"IF('Proposta Técnica'!H53=\"\",\"\",'Proposta Técnica'!H53)","v":""}]
[{"$f":"IF('Proposta Técnica'!C54=\"\",\"\",'Proposta Técnica'!C54)","v":""},{"$f":"IF('Proposta Técnica'!D54=\"\",\"\",'Proposta Técnica'!D54)","v":""},{"$f":"IF('Proposta Técnica'!E54=\"\",\"\",'Proposta Técnica'!E54)","v":""},null,{"$f":"IF('Proposta Técnica'!H54=\"\",\"\",'Proposta Técnica'!H54)","v":""}]
[{"$f":"IF('Proposta Técnica'!C55=\"\",\"\",'Proposta Técnica'!C55)","v":""},{"$f":"IF('Proposta Técnica'!D55=\"\",\"\",'Proposta Técnica'!D55)","v":""},{"$f":"IF('Proposta Técnica'!E55=\"\",\"\",'Proposta Técnica'!E55)","v":""},null,{"$f":"IF('Proposta Técnica'!H55=\"\",\"\",'Proposta Técnica'!H55)","v":""}]
[{"$f":"IF('Proposta Técnica'!C56=\"\",\"\",'Proposta Técnica'!C56)","v":""},{"$f":"IF('Proposta Técnica'!D56=\"\",\"\",'Proposta Técnica'!D56)","v":""},{"$f":"IF('Proposta Técnica'!E56=\"\",\"\",'Proposta Técnica'!E56)","v":""},null,{"$f":"IF('Proposta Técnica'!H56=\"\",\"\",'Proposta Técnica'!H56)","v":""}]
[{"$f":"IF('Proposta Técnica'!C57=\"\",\"\",'Proposta Técnica'!C57)","v":""},{"$f":"IF('Proposta Técnica'!D57=\"\",\"\",'Proposta Técnica'!D57)","v":""},{"$f":"IF('Proposta Técnica'!E57=\"\",\"\",'Proposta Técnica'!E57)","v":""},null,{"$f":"IF('Proposta Técnica'!H57=\"\",\"\",'Proposta Técnica'!H57)","v":""}]
[{"$f":"IF('Proposta Técnica'!C58=\"\",\"\",'Proposta Técnica'!C58)","v":""},{"$f":"IF('Proposta Técnica'!D58=\"\",\"\",'Proposta Técnica'!D58)","v":""},{"$f":"IF('Proposta Técnica'!E58=\"\",\"\",'Proposta Técnica'!E58)","v":""},null,{"$f":"IF('Proposta Técnica'!H58=\"\",\"\",'Proposta Técnica'!H58)","v":""}]
[{"$f":"IF('Proposta Técnica'!C59=\"\",\"\",'Proposta Técnica'!C59)","v":""},{"$f":"IF('Proposta Técnica'!D59=\"\",\"\",'Proposta Técnica'!D59)","v":""},{"$f":"IF('Proposta Técnica'!E59=\"\",\"\",'Proposta Técnica'!E59)","v":""},null,{"$f":"IF('Proposta Técnica'!H59=\"\",\"\",'Proposta Técnica'!H59)","v":""}]
[{"$f":"IF('Proposta Técnica'!C60=\"\",\"\",'Proposta Técnica'!C60)","v":""},{"$f":"IF('Proposta Técnica'!D60=\"\",\"\",'Proposta Técnica'!D60)","v":""},{"$f":"IF('Proposta Técnica'!E60=\"\",\"\",'Proposta Técnica'!E60)","v":""},null,{"$f":"IF('Proposta Técnica'!H60=\"\",\"\",'Proposta Técnica'!H60)","v":""}]
[{"$f":"IF('Proposta Técnica'!C61=\"\",\"\",'Proposta Técnica'!C61)","v":""},{"$f":"IF('Proposta Técnica'!D61=\"\",\"\",'Proposta Técnica'!D61)","v":""},{"$f":"IF('Proposta Técnica'!E61=\"\",\"\",'Proposta Técnica'!E61)","v":""},null,{"$f":"IF('Proposta Técnica'!H61=\"\",\"\",'Proposta Técnica'!H61)","v":""}]
[{"$f":"IF('Proposta Técnica'!C62=\"\",\"\",'Proposta Técnica'!C62)","v":""},{"$f":"IF('Proposta Técnica'!D62=\"\",\"\",'Proposta Técnica'!D62)","v":""},{"$f":"IF('Proposta Técnica'!E62=\"\",\"\",'Proposta Técnica'!E62)","v":""},null,{"$f":"IF('Proposta Técnica'!H62=\"\",\"\",'Proposta Técnica'!H62)","v":""}]
[{"$f":"IF('Proposta Técnica'!C63=\"\",\"\",'Proposta Técnica'!C63)","v":""},{"$f":"IF('Proposta Técnica'!D63=\"\",\"\",'Proposta Técnica'!D63)","v":""},{"$f":"IF('Proposta Técnica'!E63=\"\",\"\",'Proposta Técnica'!E63)","v":""},null,{"$f":"IF('Proposta Técnica'!H63=\"\",\"\",'Proposta Técnica'!H63)","v":""}]
[{"$f":"IF('Proposta Técnica'!C64=\"\",\"\",'Proposta Técnica'!C64)","v":""},{"$f":"IF('Proposta Técnica'!D64=\"\",\"\",'Proposta Técnica'!D64)","v":""},{"$f":"IF('Proposta Técnica'!E64=\"\",\"\",'Proposta Técnica'!E64)","v":""},null,{"$f":"IF('Proposta Técnica'!H64=\"\",\"\",'Proposta Técnica'!H64)","v":""}]
[{"$f":"IF('Proposta Técnica'!C65=\"\",\"\",'Proposta Técnica'!C65)","v":""},{"$f":"IF('Proposta Técnica'!D65=\"\",\"\",'Proposta Técnica'!D65)","v":""},{"$f":"IF('Proposta Técnica'!E65=\"\",\"\",'Proposta Técnica'!E65)","v":""},null,{"$f":"IF('Proposta Técnica'!H65=\"\",\"\",'Proposta Técnica'!H65)","v":""}]
[{"$f":"IF('Proposta Técnica'!C66=\"\",\"\",'Proposta Técnica'!C66)","v":""},{"$f":"IF('Proposta Técnica'!D66=\"\",\"\",'Proposta Técnica'!D66)","v":""},{"$f":"IF('Proposta Técnica'!E66=\"\",\"\",'Proposta Técnica'!E66)","v":""},null,{"$f":"IF('Proposta Técnica'!H66=\"\",\"\",'Proposta Técnica'!H66)","v":""}]
[{"$f":"IF('Proposta Técnica'!C67=\"\",\"\",'Proposta Técnica'!C67)","v":""},{"$f":"IF('Proposta Técnica'!D67=\"\",\"\",'Proposta Técnica'!D67)","v":""},{"$f":"IF('Proposta Técnica'!E67=\"\",\"\",'Proposta Técnica'!E67)","v":""},null,{"$f":"IF('Proposta Técnica'!H67=\"\",\"\",'Proposta Técnica'!H67)","v":""}]
[{"$f":"IF('Proposta Técnica'!C68=\"\",\"\",'Proposta Técnica'!C68)","v":""},{"$f":"IF('Proposta Técnica'!D68=\"\",\"\",'Proposta Técnica'!D68)","v":""},{"$f":"IF('Proposta Técnica'!E68=\"\",\"\",'Proposta Técnica'!E68)","v":""},null,{"$f":"IF('Proposta Técnica'!H68=\"\",\"\",'Proposta Técnica'!H68)","v":""}]
[{"$f":"IF('Proposta Técnica'!C69=\"\",\"\",'Proposta Técnica'!C69)","v":""},{"$f":"IF('Proposta Técnica'!D69=\"\",\"\",'Proposta Técnica'!D69)","v":""},{"$f":"IF('Proposta Técnica'!E69=\"\",\"\",'Proposta Técnica'!E69)","v":""},null,{"$f":"IF('Proposta Técnica'!H69=\"\",\"\",'Proposta Técnica'!H69)","v":""}]
[{"$f":"IF('Proposta Técnica'!C70=\"\",\"\",'Proposta Técnica'!C70)","v":""},{"$f":"IF('Proposta Técnica'!D70=\"\",\"\",'Proposta Técnica'!D70)","v":""},{"$f":"IF('Proposta Técnica'!E70=\"\",\"\",'Proposta Técnica'!E70)","v":""},null,{"$f":"IF('Proposta Técnica'!H70=\"\",\"\",'Proposta Técnica'!H70)","v":""}]
[{"$f":"IF('Proposta Técnica'!C71=\"\",\"\",'Proposta Técnica'!C71)","v":""},{"$f":"IF('Proposta Técnica'!D71=\"\",\"\",'Proposta Técnica'!D71)","v":""},{"$f":"IF('Proposta Técnica'!E71=\"\",\"\",'Proposta Técnica'!E71)","v":""},null,{"$f":"IF('Proposta Técnica'!H71=\"\",\"\",'Proposta Técnica'!H71)","v":""}]
[{"$f":"IF('Proposta Técnica'!C72=\"\",\"\",'Proposta Técnica'!C72)","v":""},{"$f":"IF('Proposta Técnica'!D72=\"\",\"\",'Proposta Técnica'!D72)","v":""},{"$f":"IF('Proposta Técnica'!E72=\"\",\"\",'Proposta Técnica'!E72)","v":""},null,{"$f":"IF('Proposta Técnica'!H72=\"\",\"\",'Proposta Técnica'!H72)","v":""}]
[{"$f":"IF('Proposta Técnica'!C73=\"\",\"\",'Proposta Técnica'!C73)","v":""},{"$f":"IF('Proposta Técnica'!D73=\"\",\"\",'Proposta Técnica'!D73)","v":""},{"$f":"IF('Proposta Técnica'!E73=\"\",\"\",'Proposta Técnica'!E73)","v":""},null,{"$f":"IF('Proposta Técnica'!H73=\"\",\"\",'Proposta Técnica'!H73)","v":""}]
[{"$f":"IF('Proposta Técnica'!C74=\"\",\"\",'Proposta Técnica'!C74)","v":""},{"$f":"IF('Proposta Técnica'!D74=\"\",\"\",'Proposta Técnica'!D74)","v":""},{"$f":"IF('Proposta Técnica'!E74=\"\",\"\",'Proposta Técnica'!E74)","v":""},null,{"$f":"IF('Proposta Técnica'!H74=\"\",\"\",'Proposta Técnica'!H74)","v":""}]
[{"$f":"IF('Proposta Técnica'!C75=\"\",\"\",'Proposta Técnica'!C75)","v":""},{"$f":"IF('Proposta Técnica'!D75=\"\",\"\",'Proposta Técnica'!D75)","v":""},{"$f":"IF('Proposta Técnica'!E75=\"\",\"\",'Proposta Técnica'!E75)","v":""},null,{"$f":"IF('Proposta Técnica'!H75=\"\",\"\",'Proposta Técnica'!H75)","v":""}]
[{"$f":"IF('Proposta Técnica'!C76=\"\",\"\",'Proposta Técnica'!C76)","v":""},{"$f":"IF('Proposta Técnica'!D76=\"\",\"\",'Proposta Técnica'!D76)","v":""},{"$f":"IF('Proposta Técnica'!E76=\"\",\"\",'Proposta Técnica'!E76)","v":""},null,{"$f":"IF('Proposta Técnica'!H76=\"\",\"\",'Proposta Técnica'!H76)","v":""}]
[{"$f":"IF('Proposta Técnica'!C77=\"\",\"\",'Proposta Técnica'!C77)","v":""},{"$f":"IF('Proposta Técnica'!D77=\"\",\"\",'Proposta Técnica'!D77)","v":""},{"$f":"IF('Proposta Técnica'!E77=\"\",\"\",'Proposta Técnica'!E77)","v":""},null,{"$f":"IF('Proposta Técnica'!H77=\"\",\"\",'Proposta Técnica'!H77)","v":""}]
[{"$f":"IF('Proposta Técnica'!C78=\"\",\"\",'Proposta Técnica'!C78)","v":""},{"$f":"IF('Proposta Técnica'!D78=\"\",\"\",'Proposta Técnica'!D78)","v":""},{"$f":"IF('Proposta Técnica'!E78=\"\",\"\",'Proposta Técnica'!E78)","v":""},null,{"$f":"IF('Proposta Técnica'!H78=\"\",\"\",'Proposta Técnica'!H78)","v":""}]
[{"$f":"IF('Proposta Técnica'!C79=\"\",\"\",'Proposta Técnica'!C79)","v":""},{"$f":"IF('Proposta Técnica'!D79=\"\",\"\",'Proposta Técnica'!D79)","v":""},{"$f":"IF('Proposta Técnica'!E79=\"\",\"\",'Proposta Técnica'!E79)","v":""},null,{"$f":"IF('Proposta Técnica'!H79=\"\",\"\",'Proposta Técnica'!H79)","v":""}]
[{"$f":"IF('Proposta Técnica'!C80=\"\",\"\",'Proposta Técnica'!C80)","v":""},{"$f":"IF('Proposta Técnica'!D80=\"\",\"\",'Proposta Técnica'!D80)","v":""},{"$f":"IF('Proposta Técnica'!E80=\"\",\"\",'Proposta Técnica'!E80)","v":""},null,{"$f":"IF('Proposta Técnica'!H80=\"\",\"\",'Proposta Técnica'!H80)","v":""}]
[{"$f":"IF('Proposta Técnica'!C81=\"\",\"\",'Proposta Técnica'!C81)","v":""},{"$f":"IF('Proposta Técnica'!D81=\"\",\"\",'Proposta Técnica'!D81)","v":""},{"$f":"IF('Proposta Técnica'!E81=\"\",\"\",'Proposta Técnica'!E81)","v":""},null,{"$f":"IF('Proposta Técnica'!H81=\"\",\"\",'Proposta Técnica'!H81)","v":""}]
[{"$f":"IF('Proposta Técnica'!C82=\"\",\"\",'Proposta Técnica'!C82)","v":""},{"$f":"IF('Proposta Técnica'!D82=\"\",\"\",'Proposta Técnica'!D82)","v":""},{"$f":"IF('Proposta Técnica'!E82=\"\",\"\",'Proposta Técnica'!E82)","v":""},null,{"$f":"IF('Proposta Técnica'!H82=\"\",\"\",'Proposta Técnica'!H82)","v":""}]
[{"$f":"IF('Proposta Técnica'!C83=\"\",\"\",'Proposta Técnica'!C83)","v":""},{"$f":"IF('Proposta Técnica'!D83=\"\",\"\",'Proposta Técnica'!D83)","v":""},{"$f":"IF('Proposta Técnica'!E83=\"\",\"\",'Proposta Técnica'!E83)","v":""},null,{"$f":"IF('Proposta Técnica'!H83=\"\",\"\",'Proposta Técnica'!H83)","v":""}]
[{"$f":"IF('Proposta Técnica'!C84=\"\",\"\",'Proposta Técnica'!C84)","v":""},{"$f":"IF('Proposta Técnica'!D84=\"\",\"\",'Proposta Técnica'!D84)","v":""},{"$f":"IF('Proposta Técnica'!E84=\"\",\"\",'Proposta Técnica'!E84)","v":""},null,{"$f":"IF('Proposta Técnica'!H84=\"\",\"\",'Proposta Técnica'!H84)","v":""}]
[{"$f":"IF('Proposta Técnica'!C85=\"\",\"\",'Proposta Técnica'!C85)","v":""},{"$f":"IF('Proposta Técnica'!D85=\"\",\"\",'Proposta Técnica'!D85)","v":""},{"$f":"IF('Proposta Técnica'!E85=\"\",\"\",'Proposta Técnica'!E85)","v":""},null,{"$f":"IF('Proposta Técnica'!H85=\"\",\"\",'Proposta Técnica'!H85)","v":""}]
[{"$f":"IF('Proposta Técnica'!C86=\"\",\"\",'Proposta Técnica'!C86)","v":""},{"$f":"IF('Proposta Técnica'!D86=\"\",\"\",'Proposta Técnica'!D86)","v":""},{"$f":"IF('Proposta Técnica'!E86=\"\",\"\",'Proposta Técnica'!E86)","v":""},null,{"$f":"IF('Proposta Técnica'!H86=\"\",\"\",'Proposta Técnica'!H86)","v":""}]
[{"$f":"IF('Proposta Técnica'!C87=\"\",\"\",'Proposta Técnica'!C87)","v":""},{"$f":"IF('Proposta Técnica'!D87=\"\",\"\",'Proposta Técnica'!D87)","v":""},{"$f":"IF('Proposta Técnica'!E87=\"\",\"\",'Proposta Técnica'!E87)","v":""},null,{"$f":"IF('Proposta Técnica'!H87=\"\",\"\",'Proposta Técnica'!H87)","v":""}]
[{"$f":"IF('Proposta Técnica'!C88=\"\",\"\",'Proposta Técnica'!C88)","v":""},{"$f":"IF('Proposta Técnica'!D88=\"\",\"\",'Proposta Técnica'!D88)","v":""},{"$f":"IF('Proposta Técnica'!E88=\"\",\"\",'Proposta Técnica'!E88)","v":""},null,{"$f":"IF('Proposta Técnica'!H88=\"\",\"\",'Proposta Técnica'!H88)","v":""}]
[{"$f":"IF('Proposta Técnica'!C89=\"\",\"\",'Proposta Técnica'!C89)","v":""},{"$f":"IF('Proposta Técnica'!D89=\"\",\"\",'Proposta Técnica'!D89)","v":""},{"$f":"IF('Proposta Técnica'!E89=\"\",\"\",'Proposta Técnica'!E89)","v":""},null,{"$f":"IF('Proposta Técnica'!H89=\"\",\"\",'Proposta Técnica'!H89)","v":""}]
[{"$f":"IF('Proposta Técnica'!C90=\"\",\"\",'Proposta Técnica'!C90)","v":""},{"$f":"IF('Proposta Técnica'!D90=\"\",\"\",'Proposta Técnica'!D90)","v":""},{"$f":"IF('Proposta Técnica'!E90=\"\",\"\",'Proposta Técnica'!E90)","v":""},null,{"$f":"IF('Proposta Técnica'!H90=\"\",\"\",'Proposta Técnica'!H90)","v":""}]
[{"$f":"IF('Proposta Técnica'!C91=\"\",\"\",'Proposta Técnica'!C91)","v":""},{"$f":"IF('Proposta Técnica'!D91=\"\",\"\",'Proposta Técnica'!D91)","v":""},{"$f":"IF('Proposta Técnica'!E91=\"\",\"\",'Proposta Técnica'!E91)","v":""},null,{"$f":"IF('Proposta Técnica'!H91=\"\",\"\",'Proposta Técnica'!H91)","v":""}]
[{"$f":"IF('Proposta Técnica'!C92=\"\",\"\",'Proposta Técnica'!C92)","v":""},{"$f":"IF('Proposta Técnica'!D92=\"\",\"\",'Proposta Técnica'!D92)","v":""},{"$f":"IF('Proposta Técnica'!E92=\"\",\"\",'Proposta Técnica'!E92)","v":""},null,{"$f":"IF('Proposta Técnica'!H92=\"\",\"\",'Proposta Técnica'!H92)","v":""}]
[{"$f":"IF('Proposta Técnica'!C93=\"\",\"\",'Proposta Técnica'!C93)","v":""},{"$f":"IF('Proposta Técnica'!D93=\"\",\"\",'Proposta Técnica'!D93)","v":""},{"$f":"IF('Proposta Técnica'!E93=\"\",\"\",'Proposta Técnica'!E93)","v":""},null,{"$f":"IF('Proposta Técnica'!H93=\"\",\"\",'Proposta Técnica'!H93)","v":""}]
[{"$f":"IF('Proposta Técnica'!C94=\"\",\"\",'Proposta Técnica'!C94)","v":""},{"$f":"IF('Proposta Técnica'!D94=\"\",\"\",'Proposta Técnica'!D94)","v":""},{"$f":"IF('Proposta Técnica'!E94=\"\",\"\",'Proposta Técnica'!E94)","v":""},null,{"$f":"IF('Proposta Técnica'!H94=\"\",\"\",'Proposta Técnica'!H94)","v":""}]
[{"$f":"IF('Proposta Técnica'!C95=\"\",\"\",'Proposta Técnica'!C95)","v":""},{"$f":"IF('Proposta Técnica'!D95=\"\",\"\",'Proposta Técnica'!D95)","v":""},{"$f":"IF('Proposta Técnica'!E95=\"\",\"\",'Proposta Técnica'!E95)","v":""},null,{"$f":"IF('Proposta Técnica'!H95=\"\",\"\",'Proposta Técnica'!H95)","v":""}]
[{"$f":"IF('Proposta Técnica'!C96=\"\",\"\",'Proposta Técnica'!C96)","v":""},{"$f":"IF('Proposta Técnica'!D96=\"\",\"\",'Proposta Técnica'!D96)","v":""},{"$f":"IF('Proposta Técnica'!E96=\"\",\"\",'Proposta Técnica'!E96)","v":""},null,{"$f":"IF('Proposta Técnica'!H96=\"\",\"\",'Proposta Técnica'!H96)","v":""}]
[{"$f":"IF('Proposta Técnica'!C97=\"\",\"\",'Proposta Técnica'!C97)","v":""},{"$f":"IF('Proposta Técnica'!D97=\"\",\"\",'Proposta Técnica'!D97)","v":""},{"$f":"IF('Proposta Técnica'!E97=\"\",\"\",'Proposta Técnica'!E97)","v":""},null,{"$f":"IF('Proposta Técnica'!H97=\"\",\"\",'Proposta Técnica'!H97)","v":""}]
[{"$f":"IF('Proposta Técnica'!C98=\"\",\"\",'Proposta Técnica'!C98)","v":""},{"$f":"IF('Proposta Técnica'!D98=\"\",\"\",'Proposta Técnica'!D98)","v":""},{"$f":"IF('Proposta Técnica'!E98=\"\",\"\",'Proposta Técnica'!E98)","v":""},null,{"$f":"IF('Proposta Técnica'!H98=\"\",\"\",'Proposta Técnica'!H98)","v":""}]
[{"$f":"IF('Proposta Técnica'!C99=\"\",\"\",'Proposta Técnica'!C99)","v":""},{"$f":"IF('Proposta Técnica'!D99=\"\",\"\",'Proposta Técnica'!D99)","v":""},{"$f":"IF('Proposta Técnica'!E99=\"\",\"\",'Proposta Técnica'!E99)","v":""},null,{"$f":"IF('Proposta Técnica'!H99=\"\",\"\",'Proposta Técnica'!H99)","v":""}]
[{"$f":"IF('Proposta Técnica'!C100=\"\",\"\",'Proposta Técnica'!C100)","v":""},{"$f":"IF('Proposta Técnica'!D100=\"\",\"\",'Proposta Técnica'!D100)","v":""},{"$f":"IF('Proposta Técnica'!E100=\"\",\"\",'Proposta Técnica'!E100)","v":""},null,{"$f":"IF('Proposta Técnica'!H100=\"\",\"\",'Proposta Técnica'!H100)","v":""}]
[{"$f":"IF('Proposta Técnica'!C101=\"\",\"\",'Proposta Técnica'!C101)","v":""},{"$f":"IF('Proposta Técnica'!D101=\"\",\"\",'Proposta Técnica'!D101)","v":""},{"$f":"IF('Proposta Técnica'!E101=\"\",\"\",'Proposta Técnica'!E101)","v":""},null,{"$f":"IF('Proposta Técnica'!H101=\"\",\"\",'Proposta Técnica'!H101)","v":""}]
[{"$f":"IF('Proposta Técnica'!C102=\"\",\"\",'Proposta Técnica'!C102)","v":""},{"$f":"IF('Proposta Técnica'!D102=\"\",\"\",'Proposta Técnica'!D102)","v":""},{"$f":"IF('Proposta Técnica'!E102=\"\",\"\",'Proposta Técnica'!E102)","v":""},null,{"$f":"IF('Proposta Técnica'!H102=\"\",\"\",'Proposta Técnica'!H102)","v":""}]
[{"$f":"IF('Proposta Técnica'!C103=\"\",\"\",'Proposta Técnica'!C103)","v":""},{"$f":"IF('Proposta Técnica'!D103=\"\",\"\",'Proposta Técnica'!D103)","v":""},{"$f":"IF('Proposta Técnica'!E103=\"\",\"\",'Proposta Técnica'!E103)","v":""},null,{"$f":"IF('Proposta Técnica'!H103=\"\",\"\",'Proposta Técnica'!H103)","v":""}]
[{"$f":"IF('Proposta Técnica'!C104=\"\",\"\",'Proposta Técnica'!C104)","v":""},{"$f":"IF('Proposta Técnica'!D104=\"\",\"\",'Proposta Técnica'!D104)","v":""},{"$f":"IF('Proposta Técnica'!E104=\"\",\"\",'Proposta Técnica'!E104)","v":""},null,{"$f":"IF('Proposta Técnica'!H104=\"\",\"\",'Proposta Técnica'!H104)","v":""}]
[{"$f":"IF('Proposta Técnica'!C105=\"\",\"\",'Proposta Técnica'!C105)","v":""},{"$f":"IF('Proposta Técnica'!D105=\"\",\"\",'Proposta Técnica'!D105)","v":""},{"$f":"IF('Proposta Técnica'!E105=\"\",\"\",'Proposta Técnica'!E105)","v":""},null,{"$f":"IF('Proposta Técnica'!H105=\"\",\"\",'Proposta Técnica'!H105)","v":""}]
[{"$f":"IF('Proposta Técnica'!C106=\"\",\"\",'Proposta Técnica'!C106)","v":""},{"$f":"IF('Proposta Técnica'!D106=\"\",\"\",'Proposta Técnica'!D106)","v":""},{"$f":"IF('Proposta Técnica'!E106=\"\",\"\",'Proposta Técnica'!E106)","v":""},null,{"$f":"IF('Proposta Técnica'!H106=\"\",\"\",'Proposta Técnica'!H106)","v":""}]
[{"$f":"IF('Proposta Técnica'!C107=\"\",\"\",'Proposta Técnica'!C107)","v":""},{"$f":"IF('Proposta Técnica'!D107=\"\",\"\",'Proposta Técnica'!D107)","v":""},{"$f":"IF('Proposta Técnica'!E107=\"\",\"\",'Proposta Técnica'!E107)","v":""},null,{"$f":"IF('Proposta Técnica'!H107=\"\",\"\",'Proposta Técnica'!H107)","v":""}]
[{"$f":"IF('Proposta Técnica'!C108=\"\",\"\",'Proposta Técnica'!C108)","v":""},{"$f":"IF('Proposta Técnica'!D108=\"\",\"\",'Proposta Técnica'!D108)","v":""},{"$f":"IF('Proposta Técnica'!E108=\"\",\"\",'Proposta Técnica'!E108)","v":""},null,{"$f":"IF('Proposta Técnica'!H108=\"\",\"\",'Proposta Técnica'!H108)","v":""}]
[{"$f":"IF('Proposta Técnica'!C109=\"\",\"\",'Proposta Técnica'!C109)","v":""},{"$f":"IF('Proposta Técnica'!D109=\"\",\"\",'Proposta Técnica'!D109)","v":""},{"$f":"IF('Proposta Técnica'!E109=\"\",\"\",'Proposta Técnica'!E109)","v":""},null,{"$f":"IF('Proposta Técnica'!H109=\"\",\"\",'Proposta Técnica'!H109)","v":""}]
[{"$f":"IF('Proposta Técnica'!C110=\"\",\"\",'Proposta Técnica'!C110)","v":""},{"$f":"IF('Proposta Técnica'!D110=\"\",\"\",'Proposta Técnica'!D110)","v":""},{"$f":"IF('Proposta Técnica'!E110=\"\",\"\",'Proposta Técnica'!E110)","v":""},null,{"$f":"IF('Proposta Técnica'!H110=\"\",\"\",'Proposta Técnica'!H110)","v":""}]
[{"$f":"IF('Proposta Técnica'!C111=\"\",\"\",'Proposta Técnica'!C111)","v":""},{"$f":"IF('Proposta Técnica'!D111=\"\",\"\",'Proposta Técnica'!D111)","v":""},{"$f":"IF('Proposta Técnica'!E111=\"\",\"\",'Proposta Técnica'!E111)","v":""},null,{"$f":"IF('Proposta Técnica'!H111=\"\",\"\",'Proposta Técnica'!H111)","v":""}]
[{"$f":"IF('Proposta Técnica'!C112=\"\",\"\",'Proposta Técnica'!C112)","v":""},{"$f":"IF('Proposta Técnica'!D112=\"\",\"\",'Proposta Técnica'!D112)","v":""},{"$f":"IF('Proposta Técnica'!E112=\"\",\"\",'Proposta Técnica'!E112)","v":""},null,{"$f":"IF('Proposta Técnica'!H112=\"\",\"\",'Proposta Técnica'!H112)","v":""}]
[{"$f":"IF('Proposta Técnica'!C113=\"\",\"\",'Proposta Técnica'!C113)","v":""},{"$f":"IF('Proposta Técnica'!D113=\"\",\"\",'Proposta Técnica'!D113)","v":""},{"$f":"IF('Proposta Técnica'!E113=\"\",\"\",'Proposta Técnica'!E113)","v":""},null,{"$f":"IF('Proposta Técnica'!H113=\"\",\"\",'Proposta Técnica'!H113)","v":""}]
[{"$f":"IF('Proposta Técnica'!C114=\"\",\"\",'Proposta Técnica'!C114)","v":""},{"$f":"IF('Proposta Técnica'!D114=\"\",\"\",'Proposta Técnica'!D114)","v":""},{"$f":"IF('Proposta Técnica'!E114=\"\",\"\",'Proposta Técnica'!E114)","v":""},null,{"$f":"IF('Proposta Técnica'!H114=\"\",\"\",'Proposta Técnica'!H114)","v":""}]
[{"$f":"IF('Proposta Técnica'!C115=\"\",\"\",'Proposta Técnica'!C115)","v":""},{"$f":"IF('Proposta Técnica'!D115=\"\",\"\",'Proposta Técnica'!D115)","v":""},{"$f":"IF('Proposta Técnica'!E115=\"\",\"\",'Proposta Técnica'!E115)","v":""},null,{"$f":"IF('Proposta Técnica'!H115=\"\",\"\",'Proposta Técnica'!H115)","v":""}]
[{"$f":"IF('Proposta Técnica'!C116=\"\",\"\",'Proposta Técnica'!C116)","v":""},{"$f":"IF('Proposta Técnica'!D116=\"\",\"\",'Proposta Técnica'!D116)","v":""},{"$f":"IF('Proposta Técnica'!E116=\"\",\"\",'Proposta Técnica'!E116)","v":""},null,{"$f":"IF('Proposta Técnica'!H116=\"\",\"\",'Proposta Técnica'!H116)","v":""}]
[{"$f":"IF('Proposta Técnica'!C117=\"\",\"\",'Proposta Técnica'!C117)","v":""},{"$f":"IF('Proposta Técnica'!D117=\"\",\"\",'Proposta Técnica'!D117)","v":""},{"$f":"IF('Proposta Técnica'!E117=\"\",\"\",'Proposta Técnica'!E117)","v":""},null,{"$f":"IF('Proposta Técnica'!H117=\"\",\"\",'Proposta Técnica'!H117)","v":""}]
[{"$f":"IF('Proposta Técnica'!C118=\"\",\"\",'Proposta Técnica'!C118)","v":""},{"$f":"IF('Proposta Técnica'!D118=\"\",\"\",'Proposta Técnica'!D118)","v":""},{"$f":"IF('Proposta Técnica'!E118=\"\",\"\",'Proposta Técnica'!E118)","v":""},null,{"$f":"IF('Proposta Técnica'!H118=\"\",\"\",'Proposta Técnica'!H118)","v":""}]
[{"$f":"IF('Proposta Técnica'!C119=\"\",\"\",'Proposta Técnica'!C119)","v":""},{"$f":"IF('Proposta Técnica'!D119=\"\",\"\",'Proposta Técnica'!D119)","v":""},{"$f":"IF('Proposta Técnica'!E119=\"\",\"\",'Proposta Técnica'!E119)","v":""},null,{"$f":"IF('Proposta Técnica'!H119=\"\",\"\",'Proposta Técnica'!H119)","v":""}]
[{"$f":"IF('Proposta Técnica'!C120=\"\",\"\",'Proposta Técnica'!C120)","v":""},{"$f":"IF('Proposta Técnica'!D120=\"\",\"\",'Proposta Técnica'!D120)","v":""},{"$f":"IF('Proposta Técnica'!E120=\"\",\"\",'Proposta Técnica'!E120)","v":""},null,{"$f":"IF('Proposta Técnica'!H120=\"\",\"\",'Proposta Técnica'!H120)","v":""}]
[{"$f":"IF('Proposta Técnica'!C121=\"\",\"\",'Proposta Técnica'!C121)","v":""},{"$f":"IF('Proposta Técnica'!D121=\"\",\"\",'Proposta Técnica'!D121)","v":""},{"$f":"IF('Proposta Técnica'!E121=\"\",\"\",'Proposta Técnica'!E121)","v":""},null,{"$f":"IF('Proposta Técnica'!H121=\"\",\"\",'Proposta Técnica'!H121)","v":""}]
[{"$f":"IF('Proposta Técnica'!C122=\"\",\"\",'Proposta Técnica'!C122)","v":""},{"$f":"IF('Proposta Técnica'!D122=\"\",\"\",'Proposta Técnica'!D122)","v":""},{"$f":"IF('Proposta Técnica'!E122=\"\",\"\",'Proposta Técnica'!E122)","v":""},null,{"$f":"IF('Proposta Técnica'!H122=\"\",\"\",'Proposta Técnica'!H122)","v":""}]
[{"$f":"IF('Proposta Técnica'!C123=\"\",\"\",'Proposta Técnica'!C123)","v":""},{"$f":"IF('Proposta Técnica'!D123=\"\",\"\",'Proposta Técnica'!D123)","v":""},{"$f":"IF('Proposta Técnica'!E123=\"\",\"\",'Proposta Técnica'!E123)","v":""},null,{"$f":"IF('Proposta Técnica'!H123=\"\",\"\",'Proposta Técnica'!H123)","v":""}]
[{"$f":"IF('Proposta Técnica'!C124=\"\",\"\",'Proposta Técnica'!C124)","v":""},{"$f":"IF('Proposta Técnica'!D124=\"\",\"\",'Proposta Técnica'!D124)","v":""},{"$f":"IF('Proposta Técnica'!E124=\"\",\"\",'Proposta Técnica'!E124)","v":""},null,{"$f":"IF('Proposta Técnica'!H124=\"\",\"\",'Proposta Técnica'!H124)","v":""}]
[{"$f":"IF('Proposta Técnica'!C125=\"\",\"\",'Proposta Técnica'!C125)","v":""},{"$f":"IF('Proposta Técnica'!D125=\"\",\"\",'Proposta Técnica'!D125)","v":""},{"$f":"IF('Proposta Técnica'!E125=\"\",\"\",'Proposta Técnica'!E125)","v":""},null,{"$f":"IF('Proposta Técnica'!H125=\"\",\"\",'Proposta Técnica'!H125)","v":""}]
[{"$f":"IF('Proposta Técnica'!C126=\"\",\"\",'Proposta Técnica'!C126)","v":""},{"$f":"IF('Proposta Técnica'!D126=\"\",\"\",'Proposta Técnica'!D126)","v":""},{"$f":"IF('Proposta Técnica'!E126=\"\",\"\",'Proposta Técnica'!E126)","v":""},null,{"$f":"IF('Proposta Técnica'!H126=\"\",\"\",'Proposta Técnica'!H126)","v":""}]
[{"$f":"IF('Proposta Técnica'!C127=\"\",\"\",'Proposta Técnica'!C127)","v":""},{"$f":"IF('Proposta Técnica'!D127=\"\",\"\",'Proposta Técnica'!D127)","v":""},{"$f":"IF('Proposta Técnica'!E127=\"\",\"\",'Proposta Técnica'!E127)","v":""},null,{"$f":"IF('Proposta Técnica'!H127=\"\",\"\",'Proposta Técnica'!H127)","v":""}]
[{"$f":"IF('Proposta Técnica'!C128=\"\",\"\",'Proposta Técnica'!C128)","v":""},{"$f":"IF('Proposta Técnica'!D128=\"\",\"\",'Proposta Técnica'!D128)","v":""},{"$f":"IF('Proposta Técnica'!E128=\"\",\"\",'Proposta Técnica'!E128)","v":""},null,{"$f":"IF('Proposta Técnica'!H128=\"\",\"\",'Proposta Técnica'!H128)","v":""}]
[{"$f":"IF('Proposta Técnica'!C129=\"\",\"\",'Proposta Técnica'!C129)","v":""},{"$f":"IF('Proposta Técnica'!D129=\"\",\"\",'Proposta Técnica'!D129)","v":""},{"$f":"IF('Proposta Técnica'!E129=\"\",\"\",'Proposta Técnica'!E129)","v":""},null,{"$f":"IF('Proposta Técnica'!H129=\"\",\"\",'Proposta Técnica'!H129)","v":""}]
[{"$f":"IF('Proposta Técnica'!C130=\"\",\"\",'Proposta Técnica'!C130)","v":""},{"$f":"IF('Proposta Técnica'!D130=\"\",\"\",'Proposta Técnica'!D130)","v":""},{"$f":"IF('Proposta Técnica'!E130=\"\",\"\",'Proposta Técnica'!E130)","v":""},null,{"$f":"IF('Proposta Técnica'!H130=\"\",\"\",'Proposta Técnica'!H130)","v":""}]
[{"$f":"IF('Proposta Técnica'!C131=\"\",\"\",'Proposta Técnica'!C131)","v":""},{"$f":"IF('Proposta Técnica'!D131=\"\",\"\",'Proposta Técnica'!D131)","v":""},{"$f":"IF('Proposta Técnica'!E131=\"\",\"\",'Proposta Técnica'!E131)","v":""},null,{"$f":"IF('Proposta Técnica'!H131=\"\",\"\",'Proposta Técnica'!H131)","v":""}]
[{"$f":"IF('Proposta Técnica'!C132=\"\",\"\",'Proposta Técnica'!C132)","v":""},{"$f":"IF('Proposta Técnica'!D132=\"\",\"\",'Proposta Técnica'!D132)","v":""},{"$f":"IF('Proposta Técnica'!E132=\"\",\"\",'Proposta Técnica'!E132)","v":""},null,{"$f":"IF('Proposta Técnica'!H132=\"\",\"\",'Proposta Técnica'!H132)","v":""}]
[{"$f":"IF('Proposta Técnica'!C133=\"\",\"\",'Proposta Técnica'!C133)","v":""},{"$f":"IF('Proposta Técnica'!D133=\"\",\"\",'Proposta Técnica'!D133)","v":""},{"$f":"IF('Proposta Técnica'!E133=\"\",\"\",'Proposta Técnica'!E133)","v":""},null,{"$f":"IF('Proposta Técnica'!H133=\"\",\"\",'Proposta Técnica'!H133)","v":""}]
[{"$f":"IF('Proposta Técnica'!C134=\"\",\"\",'Proposta Técnica'!C134)","v":""},{"$f":"IF('Proposta Técnica'!D134=\"\",\"\",'Proposta Técnica'!D134)","v":""},{"$f":"IF('Proposta Técnica'!E134=\"\",\"\",'Proposta Técnica'!E134)","v":""},null,{"$f":"IF('Proposta Técnica'!H134=\"\",\"\",'Proposta Técnica'!H134)","v":""}]
[{"$f":"IF('Proposta Técnica'!C135=\"\",\"\",'Proposta Técnica'!C135)","v":""},{"$f":"IF('Proposta Técnica'!D135=\"\",\"\",'Proposta Técnica'!D135)","v":""},{"$f":"IF('Proposta Técnica'!E135=\"\",\"\",'Proposta Técnica'!E135)","v":""},null,{"$f":"IF('Proposta Técnica'!H135=\"\",\"\",'Proposta Técnica'!H135)","v":""}]

{"sheet":"TDR Comercial","index":5,"n_rows":105,"n_cols":9,"rows_kept":105,"cut":false,"hidden":true,"merged":[[99,4,99,6],[100,4,100,6],[101,4,101,6],[102,4,102,6],[103,4,103,6],[104,4,104,6],[93,4,93,6],[94,4,94,6],[95,4,95,6],[96,4,96,6],[97,4,97,6],[98,4,98,6],[87,4,87,6],[88,4,88,6],[89,4,89,6],[90,4,90,6],[91,4,91,6],[92,4,92,6],[81,4,81,6],[82,4,82,6],[83,4,83,6],[84,4,84,6],[85,4,85,6],[86,4,86,6],[75,4,75,6],[76,4,76,6],[77,4,77,6],[78,4,78,6],[79,4,79,6],[80,4,80,6],[69,4,69,6],[70,4,70,6],[71,4,71,6],[72,4,72,6],[73,4,73,6],[74,4,74,6],[63,4,63,6],[64,4,64,6],[65,4,65,6],[66,4,66,6],[67,4,67,6],[68,4,68,6],[57,4,57,6],[58,4,58,6],[59,4,59,6],[60,4,60,6],[61,4,61,6],[62,4,62,6],[51,4,51,6],[52,4,52,6],[53,4,53,6],[54,4,54,6],[55,4,55,6],[56,4,56,6],[45,4,45,6],[46,4,46,6],[47,4,47,6],[48,4,48,6],[49,4,49,6],[50,4,50,6],[39,4,39,6],[40,4,40,6],[41,4,41,6],[42,4,42,6],[43,4,43,6],[44,4,44,6],[33,4,33,6],[34,4,34,6],[35,4,35,6],[36,4,36,6],[37,4,37,6],[38,4,38,6],[27,4,27,6],[28,4,28,6],[29,4,29,6],[30,4,30,6],[31,4,31,6],[32,4,32,6],[21,4,21,6],[22,4,22,6],[23,4,23,6],[24,4,24,6],[25,4,25,6],[26,4,26,6],[18,4,18,6],[19,4,19,6],[20,4,20,6],[9,4,9,6],[10,4,10,6],[11,4,11,6],[12,4,12,6],[13,4,13,6],[14,4,14,6],[4,4,4,6],[5,4,5,6],[6,4,6,6],[7,4,7,6],[8,4,8,6],[3,0,3,8],[15,4,15,6],[16,4,16,6],[17,4,17,6]]}
[]
[]
[]
["PROPOSTA COMERCIAL"]
["Item","Descrição Atividade/Produto","Valor Total (Bruto)","Parcela","Condição de desembolso  ",null,null,"Data de pagamento (prevista)","% Paga"]
[{"$f":"IF('TDR Técnica'!A20=\"\",\"\",'TDR Técnica'!A20)","v":1},{"$f":"IF('TDR Técnica'!B20=\"\",\"\",'TDR Técnica'!B20)","v":"Plano de trabalho e cronograma detalhados, com a abordagem metodológica proposta para a execução do componente institucional e de governança do diagnóstico"},{"$f":"IF('Proposta Comercial'!I12=\"\",\"\",'Proposta Comercial'!I12)","v":""},{"$f":"IF('Proposta Comercial'!J12=\"\",\"\",'Proposta Comercial'!J12)","v":""},{"$f":"IF('Proposta Comercial'!K12=\"\",\"\",'Proposta Comercial'!K12)","v":"\nApós assinatura do contrato + entrega do produto + aprovação + Entrega de NF"},null,null,"00:00:00",0]
[{"$f":"IF('TDR Técnica'!A21=\"\",\"\",'TDR Técnica'!A21)","v":2},{"$f":"IF('TDR Técnica'!B21=\"\",\"\",'TDR Técnica'!B21)","v":"Relatório preliminar de mapeamento de políticas, marcos legais e arranjos institucionais; e de mapeamento de atores-chave (órgãos governamentais, instituições de pesquisa, organizações não governamentais e parceiros regionais)."},{"$f":"IF('Proposta Comercial'!I13=\"\",\"\",'Proposta Comercial'!I13)","v":""},{"$f":"IF('Proposta Comercial'!J13=\"\",\"\",'Proposta Comercial'!J13)","v":""},{"$f":"IF('Proposta Comercial'!K13=\"\",\"\",'Proposta Comercial'!K13)","v":"\n15 dias após entrega do produto + aprovação + Entrega de NF"},null,null,"00:00:00",0]
[{"$f":"IF('TDR Técnica'!A22=\"\",\"\",'TDR Técnica'!A22)","v":3},{"$f":"IF('TDR Técnica'!B22=\"\",\"\",'TDR Técnica'!B22)","v":"Relatório de analise das políticas, marcos legais e arranjos institucionais — nacionais e internacionais — para relevantes para a proteção de baleias e seus corredores ecológicos no Brasil e na região do Atlântico Sul, com análise das oportunidades de avanço para agenda e de alinhamento da Iniciativa Corredores Azuis com processos da CMS, IWC e da ZOPACAS."},{"$f":"IF('Proposta Comercial'!I14=\"\",\"\",'Proposta Comercial'!I14)","v":""},{"$f":"IF('Proposta Comercial'!J14=\"\",\"\",'Proposta Comercial'!J14)","v":""},{"$f":"IF('Proposta Comercial'!K14=\"\",\"\",'Proposta Comercial'!K14)","v":"\n15 dias após entrega do produto + aprovação + Entrega de NF"},null,null,"00:00:00",0]
[{"$f":"IF('TDR Técnica'!A23=\"\",\"\",'TDR Técnica'!A23)","v":4},{"$f":"IF('TDR Técnica'!B23=\"\",\"\",'TDR Técnica'!B23)","v":"Relatório preliminar de mapeamento de atores-chave (órgãos governamentais, instituições de pesquisa, organizações não governamentais e parceiros regionais) pós-eleições, com análise de seus papéis, interesse e poder em relação à conservação de cetáceos e à governança de corredores azuis."},{"$f":"IF('Proposta Comercial'!I15=\"\",\"\",'Proposta Comercial'!I15)","v":""},{"$f":"IF('Proposta Comercial'!J15=\"\",\"\",'Proposta Comercial'!J15)","v":""},{"$f":"IF('Proposta Comercial'!K15=\"\",\"\",'Proposta Comercial'!K15)","v":"\n15 dias após entrega do produto + aprovação + Entrega de NF"},null,null,"00:00:00",0]
[{"$f":"IF('TDR Técnica'!A24=\"\",\"\",'TDR Técnica'!A24)","v":5},{"$f":"IF('TDR Técnica'!B24=\"\",\"\",'TDR Técnica'!B24)","v":"Versão final consolidada dos relatórios institucional e de governança, com insumos do Workshop de Corredores Azuis do Atlântico Sul"},{"$f":"IF('Proposta Comercial'!I16=\"\",\"\",'Proposta Comercial'!I16)","v":""},{"$f":"IF('Proposta Comercial'!J16=\"\",\"\",'Proposta Comercial'!J16)","v":""},{"$f":"IF('Proposta Comercial'!K16=\"\",\"\",'Proposta Comercial'!K16)","v":"\n15 dias após entrega do produto + aprovação + Entrega de NF"},null,null,"00:00:00",0]
[{"$f":"IF('TDR Técnica'!A25=\"\",\"\",'TDR Técnica'!A25)","v":""},{"$f":"IF('TDR Técnica'!B25=\"\",\"\",'TDR Técnica'!B25)","v":""},{"$f":"IF('Proposta Comercial'!I17=\"\",\"\",'Proposta Comercial'!I17)","v":""},{"$f":"IF('Proposta Comercial'!J17=\"\",\"\",'Proposta Comercial'!J17)","v":""},{"$f":"IF('Proposta Comercial'!K17=\"\",\"\",'Proposta Comercial'!K17)","v":""},null,null,"00:00:00",0]
[{"$f":"IF('TDR Técnica'!A26=\"\",\"\",'TDR Técnica'!A26)","v":""},{"$f":"IF('TDR Técnica'!B26=\"\",\"\",'TDR Técnica'!B26)","v":""},{"$f":"IF('Proposta Comercial'!I18=\"\",\"\",'Proposta Comercial'!I18)","v":""},{"$f":"IF('Proposta Comercial'!J18=\"\",\"\",'Proposta Comercial'!J18)","v":""},{"$f":"IF('Proposta Comercial'!K18=\"\",\"\",'Proposta Comercial'!K18)","v":""},null,null,"00:00:00",0]
[{"$f":"IF('TDR Técnica'!A27=\"\",\"\",'TDR Técnica'!A27)","v":""},{"$f":"IF('TDR Técnica'!B27=\"\",\"\",'TDR Técnica'!B27)","v":""},{"$f":"IF('Proposta Comercial'!I19=\"\",\"\",'Proposta Comercial'!I19)","v":""},{"$f":"IF('Proposta Comercial'!J19=\"\",\"\",'Proposta Comercial'!J19)","v":""},{"$f":"IF('Proposta Comercial'!K19=\"\",\"\",'Proposta Comercial'!K19)","v":""},null,null,"00:00:00",0]
[{"$f":"IF('TDR Técnica'!A28=\"\",\"\",'TDR Técnica'!A28)","v":""},{"$f":"IF('TDR Técnica'!B28=\"\",\"\",'TDR Técnica'!B28)","v":""},{"$f":"IF('Proposta Comercial'!I20=\"\",\"\",'Proposta Comercial'!I20)","v":""},{"$f":"IF('Proposta Comercial'!J20=\"\",\"\",'Proposta Comercial'!J20)","v":""},{"$f":"IF('Proposta Comercial'!K20=\"\",\"\",'Proposta Comercial'!K20)","v":""},null,null,"00:00:00",0]
[{"$f":"IF('TDR Técnica'!A29=\"\",\"\",'TDR Técnica'!A29)","v":""},{"$f":"IF('TDR Técnica'!B29=\"\",\"\",'TDR Técnica'!B29)","v":""},{"$f":"IF('Proposta Comercial'!I21=\"\",\"\",'Proposta Comercial'!I21)","v":""},{"$f":"IF('Proposta Comercial'!J21=\"\",\"\",'Proposta Comercial'!J21)","v":""},{"$f":"IF('Proposta Comercial'!K21=\"\",\"\",'Proposta Comercial'!K21)","v":""},null,null,"00:00:00",0]
[{"$f":"IF('TDR Técnica'!A30=\"\",\"\",'TDR Técnica'!A30)","v":""},{"$f":"IF('TDR Técnica'!B30=\"\",\"\",'TDR Técnica'!B30)","v":""},{"$f":"IF('Proposta Comercial'!I22=\"\",\"\",'Proposta Comercial'!I22)","v":""},{"$f":"IF('Proposta Comercial'!J22=\"\",\"\",'Proposta Comercial'!J22)","v":""},{"$f":"IF('Proposta Comercial'!K22=\"\",\"\",'Proposta Comercial'!K22)","v":""},null,null,"00:00:00",0]
[{"$f":"IF('TDR Técnica'!A31=\"\",\"\",'TDR Técnica'!A31)","v":""},{"$f":"IF('TDR Técnica'!B31=\"\",\"\",'TDR Técnica'!B31)","v":""},{"$f":"IF('Proposta Comercial'!I23=\"\",\"\",'Proposta Comercial'!I23)","v":""},{"$f":"IF('Proposta Comercial'!J23=\"\",\"\",'Proposta Comercial'!J23)","v":""},{"$f":"IF('Proposta Comercial'!K23=\"\",\"\",'Proposta Comercial'!K23)","v":""},null,null,"00:00:00",0]
[{"$f":"IF('TDR Técnica'!A32=\"\",\"\",'TDR Técnica'!A32)","v":""},{"$f":"IF('TDR Técnica'!B32=\"\",\"\",'TDR Técnica'!B32)","v":""},{"$f":"IF('Proposta Comercial'!I24=\"\",\"\",'Proposta Comercial'!I24)","v":""},{"$f":"IF('Proposta Comercial'!J24=\"\",\"\",'Proposta Comercial'!J24)","v":""},{"$f":"IF('Proposta Comercial'!K24=\"\",\"\",'Proposta Comercial'!K24)","v":""},null,null,"00:00:00",0]
[{"$f":"IF('TDR Técnica'!A33=\"\",\"\",'TDR Técnica'!A33)","v":""},{"$f":"IF('TDR Técnica'!B33=\"\",\"\",'TDR Técnica'!B33)","v":""},{"$f":"IF('Proposta Comercial'!I25=\"\",\"\",'Proposta Comercial'!I25)","v":""},{"$f":"IF('Proposta Comercial'!J25=\"\",\"\",'Proposta Comercial'!J25)","v":""},{"$f":"IF('Proposta Comercial'!K25=\"\",\"\",'Proposta Comercial'!K25)","v":""},null,null,"00:00:00",0]
[{"$f":"IF('TDR Técnica'!A34=\"\",\"\",'TDR Técnica'!A34)","v":""},{"$f":"IF('TDR Técnica'!B34=\"\",\"\",'TDR Técnica'!B34)","v":""},{"$f":"IF('Proposta Comercial'!I26=\"\",\"\",'Proposta Comercial'!I26)","v":""},{"$f":"IF('Proposta Comercial'!J26=\"\",\"\",'Proposta Comercial'!J26)","v":""},{"$f":"IF('Proposta Comercial'!K26=\"\",\"\",'Proposta Comercial'!K26)","v":""},null,null,"00:00:00",0]
[{"$f":"IF('TDR Técnica'!A35=\"\",\"\",'TDR Técnica'!A35)","v":""},{"$f":"IF('TDR Técnica'!B35=\"\",\"\",'TDR Técnica'!B35)","v":""},{"$f":"IF('Proposta Comercial'!I27=\"\",\"\",'Proposta Comercial'!I27)","v":""},{"$f":"IF('Proposta Comercial'!J27=\"\",\"\",'Proposta Comercial'!J27)","v":""},{"$f":"IF('Proposta Comercial'!K27=\"\",\"\",'Proposta Comercial'!K27)","v":""},null,null,"00:00:00",0]
[{"$f":"IF('TDR Técnica'!A36=\"\",\"\",'TDR Técnica'!A36)","v":""},{"$f":"IF('TDR Técnica'!B36=\"\",\"\",'TDR Técnica'!B36)","v":""},{"$f":"IF('Proposta Comercial'!I28=\"\",\"\",'Proposta Comercial'!I28)","v":""},{"$f":"IF('Proposta Comercial'!J28=\"\",\"\",'Proposta Comercial'!J28)","v":""},{"$f":"IF('Proposta Comercial'!K28=\"\",\"\",'Proposta Comercial'!K28)","v":""},null,null,"00:00:00",0]
[{"$f":"IF('TDR Técnica'!A37=\"\",\"\",'TDR Técnica'!A37)","v":""},{"$f":"IF('TDR Técnica'!B37=\"\",\"\",'TDR Técnica'!B37)","v":""},{"$f":"IF('Proposta Comercial'!I29=\"\",\"\",'Proposta Comercial'!I29)","v":""},{"$f":"IF('Proposta Comercial'!J29=\"\",\"\",'Proposta Comercial'!J29)","v":""},{"$f":"IF('Proposta Comercial'!K29=\"\",\"\",'Proposta Comercial'!K29)","v":""},null,null,"00:00:00",0]
[{"$f":"IF('TDR Técnica'!A38=\"\",\"\",'TDR Técnica'!A38)","v":""},{"$f":"IF('TDR Técnica'!B38=\"\",\"\",'TDR Técnica'!B38)","v":""},{"$f":"IF('Proposta Comercial'!I30=\"\",\"\",'Proposta Comercial'!I30)","v":""},{"$f":"IF('Proposta Comercial'!J30=\"\",\"\",'Proposta Comercial'!J30)","v":""},{"$f":"IF('Proposta Comercial'!K30=\"\",\"\",'Proposta Comercial'!K30)","v":""},null,null,"00:00:00",0]
[{"$f":"IF('TDR Técnica'!A39=\"\",\"\",'TDR Técnica'!A39)","v":""},{"$f":"IF('TDR Técnica'!B39=\"\",\"\",'TDR Técnica'!B39)","v":""},{"$f":"IF('Proposta Comercial'!I31=\"\",\"\",'Proposta Comercial'!I31)","v":""},{"$f":"IF('Proposta Comercial'!J31=\"\",\"\",'Proposta Comercial'!J31)","v":""},{"$f":"IF('Proposta Comercial'!K31=\"\",\"\",'Proposta Comercial'!K31)","v":""},null,null,"00:00:00",0]
[{"$f":"IF('TDR Técnica'!A40=\"\",\"\",'TDR Técnica'!A40)","v":""},{"$f":"IF('TDR Técnica'!B40=\"\",\"\",'TDR Técnica'!B40)","v":""},{"$f":"IF('Proposta Comercial'!I32=\"\",\"\",'Proposta Comercial'!I32)","v":""},{"$f":"IF('Proposta Comercial'!J32=\"\",\"\",'Proposta Comercial'!J32)","v":""},{"$f":"IF('Proposta Comercial'!K32=\"\",\"\",'Proposta Comercial'!K32)","v":""},null,null,"00:00:00",0]
[{"$f":"IF('TDR Técnica'!A41=\"\",\"\",'TDR Técnica'!A41)","v":""},{"$f":"IF('TDR Técnica'!B41=\"\",\"\",'TDR Técnica'!B41)","v":""},{"$f":"IF('Proposta Comercial'!I33=\"\",\"\",'Proposta Comercial'!I33)","v":""},{"$f":"IF('Proposta Comercial'!J33=\"\",\"\",'Proposta Comercial'!J33)","v":""},{"$f":"IF('Proposta Comercial'!K33=\"\",\"\",'Proposta Comercial'!K33)","v":""},null,null,"00:00:00",0]
[{"$f":"IF('TDR Técnica'!A42=\"\",\"\",'TDR Técnica'!A42)","v":""},{"$f":"IF('TDR Técnica'!B42=\"\",\"\",'TDR Técnica'!B42)","v":""},{"$f":"IF('Proposta Comercial'!I34=\"\",\"\",'Proposta Comercial'!I34)","v":""},{"$f":"IF('Proposta Comercial'!J34=\"\",\"\",'Proposta Comercial'!J34)","v":""},{"$f":"IF('Proposta Comercial'!K34=\"\",\"\",'Proposta Comercial'!K34)","v":""},null,null,"00:00:00",0]
[{"$f":"IF('TDR Técnica'!A43=\"\",\"\",'TDR Técnica'!A43)","v":""},{"$f":"IF('TDR Técnica'!B43=\"\",\"\",'TDR Técnica'!B43)","v":""},{"$f":"IF('Proposta Comercial'!I35=\"\",\"\",'Proposta Comercial'!I35)","v":""},{"$f":"IF('Proposta Comercial'!J35=\"\",\"\",'Proposta Comercial'!J35)","v":""},{"$f":"IF('Proposta Comercial'!K35=\"\",\"\",'Proposta Comercial'!K35)","v":""},null,null,"00:00:00",0]
[{"$f":"IF('TDR Técnica'!A44=\"\",\"\",'TDR Técnica'!A44)","v":""},{"$f":"IF('TDR Técnica'!B44=\"\",\"\",'TDR Técnica'!B44)","v":""},{"$f":"IF('Proposta Comercial'!I36=\"\",\"\",'Proposta Comercial'!I36)","v":""},{"$f":"IF('Proposta Comercial'!J36=\"\",\"\",'Proposta Comercial'!J36)","v":""},{"$f":"IF('Proposta Comercial'!K36=\"\",\"\",'Proposta Comercial'!K36)","v":""},null,null,"00:00:00",0]
[{"$f":"IF('TDR Técnica'!A45=\"\",\"\",'TDR Técnica'!A45)","v":""},{"$f":"IF('TDR Técnica'!B45=\"\",\"\",'TDR Técnica'!B45)","v":""},{"$f":"IF('Proposta Comercial'!I37=\"\",\"\",'Proposta Comercial'!I37)","v":""},{"$f":"IF('Proposta Comercial'!J37=\"\",\"\",'Proposta Comercial'!J37)","v":""},{"$f":"IF('Proposta Comercial'!K37=\"\",\"\",'Proposta Comercial'!K37)","v":""},null,null,"00:00:00",0]
[{"$f":"IF('TDR Técnica'!A46=\"\",\"\",'TDR Técnica'!A46)","v":""},{"$f":"IF('TDR Técnica'!B46=\"\",\"\",'TDR Técnica'!B46)","v":""},{"$f":"IF('Proposta Comercial'!I38=\"\",\"\",'Proposta Comercial'!I38)","v":""},{"$f":"IF('Proposta Comercial'!J38=\"\",\"\",'Proposta Comercial'!J38)","v":""},{"$f":"IF('Proposta Comercial'!K38=\"\",\"\",'Proposta Comercial'!K38)","v":""},null,null,"00:00:00",0]
[{"$f":"IF('TDR Técnica'!A47=\"\",\"\",'TDR Técnica'!A47)","v":""},{"$f":"IF('TDR Técnica'!B47=\"\",\"\",'TDR Técnica'!B47)","v":""},{"$f":"IF('Proposta Comercial'!I39=\"\",\"\",'Proposta Comercial'!I39)","v":""},{"$f":"IF('Proposta Comercial'!J39=\"\",\"\",'Proposta Comercial'!J39)","v":""},{"$f":"IF('Proposta Comercial'!K39=\"\",\"\",'Proposta Comercial'!K39)","v":""},null,null,"00:00:00",0]
[{"$f":"IF('TDR Técnica'!A48=\"\",\"\",'TDR Técnica'!A48)","v":""},{"$f":"IF('TDR Técnica'!B48=\"\",\"\",'TDR Técnica'!B48)","v":""},{"$f":"IF('Proposta Comercial'!I40=\"\",\"\",'Proposta Comercial'!I40)","v":""},{"$f":"IF('Proposta Comercial'!J40=\"\",\"\",'Proposta Comercial'!J40)","v":""},{"$f":"IF('Proposta Comercial'!K40=\"\",\"\",'Proposta Comercial'!K40)","v":""},null,null,"00:00:00",0]
[{"$f":"IF('TDR Técnica'!A49=\"\",\"\",'TDR Técnica'!A49)","v":""},{"$f":"IF('TDR Técnica'!B49=\"\",\"\",'TDR Técnica'!B49)","v":""},{"$f":"IF('Proposta Comercial'!I41=\"\",\"\",'Proposta Comercial'!I41)","v":""},{"$f":"IF('Proposta Comercial'!J41=\"\",\"\",'Proposta Comercial'!J41)","v":""},{"$f":"IF('Proposta Comercial'!K41=\"\",\"\",'Proposta Comercial'!K41)","v":""},null,null,"00:00:00",0]
[{"$f":"IF('TDR Técnica'!A50=\"\",\"\",'TDR Técnica'!A50)","v":""},{"$f":"IF('TDR Técnica'!B50=\"\",\"\",'TDR Técnica'!B50)","v":""},{"$f":"IF('Proposta Comercial'!I42=\"\",\"\",'Proposta Comercial'!I42)","v":""},{"$f":"IF('Proposta Comercial'!J42=\"\",\"\",'Proposta Comercial'!J42)","v":""},{"$f":"IF('Proposta Comercial'!K42=\"\",\"\",'Proposta Comercial'!K42)","v":""},null,null,"00:00:00",0]
[{"$f":"IF('TDR Técnica'!A51=\"\",\"\",'TDR Técnica'!A51)","v":""},{"$f":"IF('TDR Técnica'!B51=\"\",\"\",'TDR Técnica'!B51)","v":""},{"$f":"IF('Proposta Comercial'!I43=\"\",\"\",'Proposta Comercial'!I43)","v":""},{"$f":"IF('Proposta Comercial'!J43=\"\",\"\",'Proposta Comercial'!J43)","v":""},{"$f":"IF('Proposta Comercial'!K43=\"\",\"\",'Proposta Comercial'!K43)","v":""},null,null,"00:00:00",0]
[{"$f":"IF('TDR Técnica'!A52=\"\",\"\",'TDR Técnica'!A52)","v":""},{"$f":"IF('TDR Técnica'!B52=\"\",\"\",'TDR Técnica'!B52)","v":""},{"$f":"IF('Proposta Comercial'!I44=\"\",\"\",'Proposta Comercial'!I44)","v":""},{"$f":"IF('Proposta Comercial'!J44=\"\",\"\",'Proposta Comercial'!J44)","v":""},{"$f":"IF('Proposta Comercial'!K44=\"\",\"\",'Proposta Comercial'!K44)","v":""},null,null,"00:00:00",0]
[{"$f":"IF('TDR Técnica'!A53=\"\",\"\",'TDR Técnica'!A53)","v":""},{"$f":"IF('TDR Técnica'!B53=\"\",\"\",'TDR Técnica'!B53)","v":""},{"$f":"IF('Proposta Comercial'!I45=\"\",\"\",'Proposta Comercial'!I45)","v":""},{"$f":"IF('Proposta Comercial'!J45=\"\",\"\",'Proposta Comercial'!J45)","v":""},{"$f":"IF('Proposta Comercial'!K45=\"\",\"\",'Proposta Comercial'!K45)","v":""},null,null,"00:00:00",0]
[{"$f":"IF('TDR Técnica'!A54=\"\",\"\",'TDR Técnica'!A54)","v":""},{"$f":"IF('TDR Técnica'!B54=\"\",\"\",'TDR Técnica'!B54)","v":""},{"$f":"IF('Proposta Comercial'!I46=\"\",\"\",'Proposta Comercial'!I46)","v":""},{"$f":"IF('Proposta Comercial'!J46=\"\",\"\",'Proposta Comercial'!J46)","v":""},{"$f":"IF('Proposta Comercial'!K46=\"\",\"\",'Proposta Comercial'!K46)","v":""},null,null,"00:00:00",0]
[{"$f":"IF('TDR Técnica'!A55=\"\",\"\",'TDR Técnica'!A55)","v":""},{"$f":"IF('TDR Técnica'!B55=\"\",\"\",'TDR Técnica'!B55)","v":""},{"$f":"IF('Proposta Comercial'!I47=\"\",\"\",'Proposta Comercial'!I47)","v":""},{"$f":"IF('Proposta Comercial'!J47=\"\",\"\",'Proposta Comercial'!J47)","v":""},{"$f":"IF('Proposta Comercial'!K47=\"\",\"\",'Proposta Comercial'!K47)","v":""},null,null,"00:00:00",0]
[{"$f":"IF('TDR Técnica'!A56=\"\",\"\",'TDR Técnica'!A56)","v":""},{"$f":"IF('TDR Técnica'!B56=\"\",\"\",'TDR Técnica'!B56)","v":""},{"$f":"IF('Proposta Comercial'!I48=\"\",\"\",'Proposta Comercial'!I48)","v":""},{"$f":"IF('Proposta Comercial'!J48=\"\",\"\",'Proposta Comercial'!J48)","v":""},{"$f":"IF('Proposta Comercial'!K48=\"\",\"\",'Proposta Comercial'!K48)","v":""},null,null,"00:00:00",0]
[{"$f":"IF('TDR Técnica'!A57=\"\",\"\",'TDR Técnica'!A57)","v":""},{"$f":"IF('TDR Técnica'!B57=\"\",\"\",'TDR Técnica'!B57)","v":""},{"$f":"IF('Proposta Comercial'!I49=\"\",\"\",'Proposta Comercial'!I49)","v":""},{"$f":"IF('Proposta Comercial'!J49=\"\",\"\",'Proposta Comercial'!J49)","v":""},{"$f":"IF('Proposta Comercial'!K49=\"\",\"\",'Proposta Comercial'!K49)","v":""},null,null,"00:00:00",0]
[{"$f":"IF('TDR Técnica'!A58=\"\",\"\",'TDR Técnica'!A58)","v":""},{"$f":"IF('TDR Técnica'!B58=\"\",\"\",'TDR Técnica'!B58)","v":""},{"$f":"IF('Proposta Comercial'!I50=\"\",\"\",'Proposta Comercial'!I50)","v":""},{"$f":"IF('Proposta Comercial'!J50=\"\",\"\",'Proposta Comercial'!J50)","v":""},{"$f":"IF('Proposta Comercial'!K50=\"\",\"\",'Proposta Comercial'!K50)","v":""},null,null,"00:00:00",0]
[{"$f":"IF('TDR Técnica'!A59=\"\",\"\",'TDR Técnica'!A59)","v":""},{"$f":"IF('TDR Técnica'!B59=\"\",\"\",'TDR Técnica'!B59)","v":""},{"$f":"IF('Proposta Comercial'!I51=\"\",\"\",'Proposta Comercial'!I51)","v":""},{"$f":"IF('Proposta Comercial'!J51=\"\",\"\",'Proposta Comercial'!J51)","v":""},{"$f":"IF('Proposta Comercial'!K51=\"\",\"\",'Proposta Comercial'!K51)","v":""},null,null,"00:00:00",0]
[{"$f":"IF('TDR Técnica'!A60=\"\",\"\",'TDR Técnica'!A60)","v":""},{"$f":"IF('TDR Técnica'!B60=\"\",\"\",'TDR Técnica'!B60)","v":""},{"$f":"IF('Proposta Comercial'!I52=\"\",\"\",'Proposta Comercial'!I52)","v":""},{"$f":"IF('Proposta Comercial'!J52=\"\",\"\",'Proposta Comercial'!J52)","v":""},{"$f":"IF('Proposta Comercial'!K52=\"\",\"\",'Proposta Comercial'!K52)","v":""},null,null,"00:00:00",0]
[{"$f":"IF('TDR Técnica'!A61=\"\",\"\",'TDR Técnica'!A61)","v":""},{"$f":"IF('TDR Técnica'!B61=\"\",\"\",'TDR Técnica'!B61)","v":""},{"$f":"IF('Proposta Comercial'!I53=\"\",\"\",'Proposta Comercial'!I53)","v":""},{"$f":"IF('Proposta Comercial'!J53=\"\",\"\",'Proposta Comercial'!J53)","v":""},{"$f":"IF('Proposta Comercial'!K53=\"\",\"\",'Proposta Comercial'!K53)","v":""},null,null,"00:00:00",0]
[{"$f":"IF('TDR Técnica'!A62=\"\",\"\",'TDR Técnica'!A62)","v":""},{"$f":"IF('TDR Técnica'!B62=\"\",\"\",'TDR Técnica'!B62)","v":""},{"$f":"IF('Proposta Comercial'!I54=\"\",\"\",'Proposta Comercial'!I54)","v":""},{"$f":"IF('Proposta Comercial'!J54=\"\",\"\",'Proposta Comercial'!J54)","v":""},{"$f":"IF('Proposta Comercial'!K54=\"\",\"\",'Proposta Comercial'!K54)","v":""},null,null,"00:00:00",0]
[{"$f":"IF('TDR Técnica'!A63=\"\",\"\",'TDR Técnica'!A63)","v":""},{"$f":"IF('TDR Técnica'!B63=\"\",\"\",'TDR Técnica'!B63)","v":""},{"$f":"IF('Proposta Comercial'!I55=\"\",\"\",'Proposta Comercial'!I55)","v":""},{"$f":"IF('Proposta Comercial'!J55=\"\",\"\",'Proposta Comercial'!J55)","v":""},{"$f":"IF('Proposta Comercial'!K55=\"\",\"\",'Proposta Comercial'!K55)","v":""},null,null,"00:00:00",0]
[{"$f":"IF('TDR Técnica'!A64=\"\",\"\",'TDR Técnica'!A64)","v":""},{"$f":"IF('TDR Técnica'!B64=\"\",\"\",'TDR Técnica'!B64)","v":""},{"$f":"IF('Proposta Comercial'!I56=\"\",\"\",'Proposta Comercial'!I56)","v":""},{"$f":"IF('Proposta Comercial'!J56=\"\",\"\",'Proposta Comercial'!J56)","v":""},{"$f":"IF('Proposta Comercial'!K56=\"\",\"\",'Proposta Comercial'!K56)","v":""},null,null,"00:00:00",0]
[{"$f":"IF('TDR Técnica'!A65=\"\",\"\",'TDR Técnica'!A65)","v":""},{"$f":"IF('TDR Técnica'!B65=\"\",\"\",'TDR Técnica'!B65)","v":""},{"$f":"IF('Proposta Comercial'!I57=\"\",\"\",'Proposta Comercial'!I57)","v":""},{"$f":"IF('Proposta Comercial'!J57=\"\",\"\",'Proposta Comercial'!J57)","v":""},{"$f":"IF('Proposta Comercial'!K57=\"\",\"\",'Proposta Comercial'!K57)","v":""},null,null,"00:00:00",0]
[{"$f":"IF('TDR Técnica'!A66=\"\",\"\",'TDR Técnica'!A66)","v":""},{"$f":"IF('TDR Técnica'!B66=\"\",\"\",'TDR Técnica'!B66)","v":""},{"$f":"IF('Proposta Comercial'!I58=\"\",\"\",'Proposta Comercial'!I58)","v":""},{"$f":"IF('Proposta Comercial'!J58=\"\",\"\",'Proposta Comercial'!J58)","v":""},{"$f":"IF('Proposta Comercial'!K58=\"\",\"\",'Proposta Comercial'!K58)","v":""},null,null,"00:00:00",0]
[{"$f":"IF('TDR Técnica'!A67=\"\",\"\",'TDR Técnica'!A67)","v":""},{"$f":"IF('TDR Técnica'!B67=\"\",\"\",'TDR Técnica'!B67)","v":""},{"$f":"IF('Proposta Comercial'!I59=\"\",\"\",'Proposta Comercial'!I59)","v":""},{"$f":"IF('Proposta Comercial'!J59=\"\",\"\",'Proposta Comercial'!J59)","v":""},{"$f":"IF('Proposta Comercial'!K59=\"\",\"\",'Proposta Comercial'!K59)","v":""},null,null,"00:00:00",0]
[{"$f":"IF('TDR Técnica'!A68=\"\",\"\",'TDR Técnica'!A68)","v":""},{"$f":"IF('TDR Técnica'!B68=\"\",\"\",'TDR Técnica'!B68)","v":""},{"$f":"IF('Proposta Comercial'!I60=\"\",\"\",'Proposta Comercial'!I60)","v":""},{"$f":"IF('Proposta Comercial'!J60=\"\",\"\",'Proposta Comercial'!J60)","v":""},{"$f":"IF('Proposta Comercial'!K60=\"\",\"\",'Proposta Comercial'!K60)","v":""},null,null,"00:00:00",0]
[{"$f":"IF('TDR Técnica'!A69=\"\",\"\",'TDR Técnica'!A69)","v":""},{"$f":"IF('TDR Técnica'!B69=\"\",\"\",'TDR Técnica'!B69)","v":""},{"$f":"IF('Proposta Comercial'!I61=\"\",\"\",'Proposta Comercial'!I61)","v":""},{"$f":"IF('Proposta Comercial'!J61=\"\",\"\",'Proposta Comercial'!J61)","v":""},{"$f":"IF('Proposta Comercial'!K61=\"\",\"\",'Proposta Comercial'!K61)","v":""},null,null,"00:00:00",0]
[{"$f":"IF('TDR Técnica'!A70=\"\",\"\",'TDR Técnica'!A70)","v":""},{"$f":"IF('TDR Técnica'!B70=\"\",\"\",'TDR Técnica'!B70)","v":""},{"$f":"IF('Proposta Comercial'!I62=\"\",\"\",'Proposta Comercial'!I62)","v":""},{"$f":"IF('Proposta Comercial'!J62=\"\",\"\",'Proposta Comercial'!J62)","v":""},{"$f":"IF('Proposta Comercial'!K62=\"\",\"\",'Proposta Comercial'!K62)","v":""},null,null,"00:00:00",0]
[{"$f":"IF('TDR Técnica'!A71=\"\",\"\",'TDR Técnica'!A71)","v":""},{"$f":"IF('TDR Técnica'!B71=\"\",\"\",'TDR Técnica'!B71)","v":""},{"$f":"IF('Proposta Comercial'!I63=\"\",\"\",'Proposta Comercial'!I63)","v":""},{"$f":"IF('Proposta Comercial'!J63=\"\",\"\",'Proposta Comercial'!J63)","v":""},{"$f":"IF('Proposta Comercial'!K63=\"\",\"\",'Proposta Comercial'!K63)","v":""},null,null,"00:00:00",0]
[{"$f":"IF('TDR Técnica'!A72=\"\",\"\",'TDR Técnica'!A72)","v":""},{"$f":"IF('TDR Técnica'!B72=\"\",\"\",'TDR Técnica'!B72)","v":""},{"$f":"IF('Proposta Comercial'!I64=\"\",\"\",'Proposta Comercial'!I64)","v":""},{"$f":"IF('Proposta Comercial'!J64=\"\",\"\",'Proposta Comercial'!J64)","v":""},{"$f":"IF('Proposta Comercial'!K64=\"\",\"\",'Proposta Comercial'!K64)","v":""},null,null,"00:00:00",0]
[{"$f":"IF('TDR Técnica'!A73=\"\",\"\",'TDR Técnica'!A73)","v":""},{"$f":"IF('TDR Técnica'!B73=\"\",\"\",'TDR Técnica'!B73)","v":""},{"$f":"IF('Proposta Comercial'!I65=\"\",\"\",'Proposta Comercial'!I65)","v":""},{"$f":"IF('Proposta Comercial'!J65=\"\",\"\",'Proposta Comercial'!J65)","v":""},{"$f":"IF('Proposta Comercial'!K65=\"\",\"\",'Proposta Comercial'!K65)","v":""},null,null,"00:00:00",0]
[{"$f":"IF('TDR Técnica'!A74=\"\",\"\",'TDR Técnica'!A74)","v":""},{"$f":"IF('TDR Técnica'!B74=\"\",\"\",'TDR Técnica'!B74)","v":""},{"$f":"IF('Proposta Comercial'!I66=\"\",\"\",'Proposta Comercial'!I66)","v":""},{"$f":"IF('Proposta Comercial'!J66=\"\",\"\",'Proposta Comercial'!J66)","v":""},{"$f":"IF('Proposta Comercial'!K66=\"\",\"\",'Proposta Comercial'!K66)","v":""},null,null,"00:00:00",0]
[{"$f":"IF('TDR Técnica'!A75=\"\",\"\",'TDR Técnica'!A75)","v":""},{"$f":"IF('TDR Técnica'!B75=\"\",\"\",'TDR Técnica'!B75)","v":""},{"$f":"IF('Proposta Comercial'!I67=\"\",\"\",'Proposta Comercial'!I67)","v":""},{"$f":"IF('Proposta Comercial'!J67=\"\",\"\",'Proposta Comercial'!J67)","v":""},{"$f":"IF('Proposta Comercial'!K67=\"\",\"\",'Proposta Comercial'!K67)","v":""},null,null,"00:00:00",0]
[{"$f":"IF('TDR Técnica'!A76=\"\",\"\",'TDR Técnica'!A76)","v":""},{"$f":"IF('TDR Técnica'!B76=\"\",\"\",'TDR Técnica'!B76)","v":""},{"$f":"IF('Proposta Comercial'!I68=\"\",\"\",'Proposta Comercial'!I68)","v":""},{"$f":"IF('Proposta Comercial'!J68=\"\",\"\",'Proposta Comercial'!J68)","v":""},{"$f":"IF('Proposta Comercial'!K68=\"\",\"\",'Proposta Comercial'!K68)","v":""},null,null,"00:00:00",0]
[{"$f":"IF('TDR Técnica'!A77=\"\",\"\",'TDR Técnica'!A77)","v":""},{"$f":"IF('TDR Técnica'!B77=\"\",\"\",'TDR Técnica'!B77)","v":""},{"$f":"IF('Proposta Comercial'!I69=\"\",\"\",'Proposta Comercial'!I69)","v":""},{"$f":"IF('Proposta Comercial'!J69=\"\",\"\",'Proposta Comercial'!J69)","v":""},{"$f":"IF('Proposta Comercial'!K69=\"\",\"\",'Proposta Comercial'!K69)","v":""},null,null,"00:00:00",0]
[{"$f":"IF('TDR Técnica'!A78=\"\",\"\",'TDR Técnica'!A78)","v":""},{"$f":"IF('TDR Técnica'!B78=\"\",\"\",'TDR Técnica'!B78)","v":""},{"$f":"IF('Proposta Comercial'!I70=\"\",\"\",'Proposta Comercial'!I70)","v":""},{"$f":"IF('Proposta Comercial'!J70=\"\",\"\",'Proposta Comercial'!J70)","v":""},{"$f":"IF('Proposta Comercial'!K70=\"\",\"\",'Proposta Comercial'!K70)","v":""},null,null,"00:00:00",0]
[{"$f":"IF('TDR Técnica'!A79=\"\",\"\",'TDR Técnica'!A79)","v":""},{"$f":"IF('TDR Técnica'!B79=\"\",\"\",'TDR Técnica'!B79)","v":""},{"$f":"IF('Proposta Comercial'!I71=\"\",\"\",'Proposta Comercial'!I71)","v":""},{"$f":"IF('Proposta Comercial'!J71=\"\",\"\",'Proposta Comercial'!J71)","v":""},{"$f":"IF('Proposta Comercial'!K71=\"\",\"\",'Proposta Comercial'!K71)","v":""},null,null,"00:00:00",0]
[{"$f":"IF('TDR Técnica'!A80=\"\",\"\",'TDR Técnica'!A80)","v":""},{"$f":"IF('TDR Técnica'!B80=\"\",\"\",'TDR Técnica'!B80)","v":""},{"$f":"IF('Proposta Comercial'!I72=\"\",\"\",'Proposta Comercial'!I72)","v":""},{"$f":"IF('Proposta Comercial'!J72=\"\",\"\",'Proposta Comercial'!J72)","v":""},{"$f":"IF('Proposta Comercial'!K72=\"\",\"\",'Proposta Comercial'!K72)","v":""},null,null,"00:00:00",0]
[{"$f":"IF('TDR Técnica'!A81=\"\",\"\",'TDR Técnica'!A81)","v":""},{"$f":"IF('TDR Técnica'!B81=\"\",\"\",'TDR Técnica'!B81)","v":""},{"$f":"IF('Proposta Comercial'!I73=\"\",\"\",'Proposta Comercial'!I73)","v":""},{"$f":"IF('Proposta Comercial'!J73=\"\",\"\",'Proposta Comercial'!J73)","v":""},{"$f":"IF('Proposta Comercial'!K73=\"\",\"\",'Proposta Comercial'!K73)","v":""},null,null,"00:00:00",0]
[{"$f":"IF('TDR Técnica'!A82=\"\",\"\",'TDR Técnica'!A82)","v":""},{"$f":"IF('TDR Técnica'!B82=\"\",\"\",'TDR Técnica'!B82)","v":""},{"$f":"IF('Proposta Comercial'!I74=\"\",\"\",'Proposta Comercial'!I74)","v":""},{"$f":"IF('Proposta Comercial'!J74=\"\",\"\",'Proposta Comercial'!J74)","v":""},{"$f":"IF('Proposta Comercial'!K74=\"\",\"\",'Proposta Comercial'!K74)","v":""},null,null,"00:00:00",0]
[{"$f":"IF('TDR Técnica'!A83=\"\",\"\",'TDR Técnica'!A83)","v":""},{"$f":"IF('TDR Técnica'!B83=\"\",\"\",'TDR Técnica'!B83)","v":""},{"$f":"IF('Proposta Comercial'!I75=\"\",\"\",'Proposta Comercial'!I75)","v":""},{"$f":"IF('Proposta Comercial'!J75=\"\",\"\",'Proposta Comercial'!J75)","v":""},{"$f":"IF('Proposta Comercial'!K75=\"\",\"\",'Proposta Comercial'!K75)","v":""},null,null,"00:00:00",0]
[{"$f":"IF('TDR Técnica'!A84=\"\",\"\",'TDR Técnica'!A84)","v":""},{"$f":"IF('TDR Técnica'!B84=\"\",\"\",'TDR Técnica'!B84)","v":""},{"$f":"IF('Proposta Comercial'!I76=\"\",\"\",'Proposta Comercial'!I76)","v":""},{"$f":"IF('Proposta Comercial'!J76=\"\",\"\",'Proposta Comercial'!J76)","v":""},{"$f":"IF('Proposta Comercial'!K76=\"\",\"\",'Proposta Comercial'!K76)","v":""},null,null,"00:00:00",0]
[{"$f":"IF('TDR Técnica'!A85=\"\",\"\",'TDR Técnica'!A85)","v":""},{"$f":"IF('TDR Técnica'!B85=\"\",\"\",'TDR Técnica'!B85)","v":""},{"$f":"IF('Proposta Comercial'!I77=\"\",\"\",'Proposta Comercial'!I77)","v":""},{"$f":"IF('Proposta Comercial'!J77=\"\",\"\",'Proposta Comercial'!J77)","v":""},{"$f":"IF('Proposta Comercial'!K77=\"\",\"\",'Proposta Comercial'!K77)","v":""},null,null,"00:00:00",0]
[{"$f":"IF('TDR Técnica'!A86=\"\",\"\",'TDR Técnica'!A86)","v":""},{"$f":"IF('TDR Técnica'!B86=\"\",\"\",'TDR Técnica'!B86)","v":""},{"$f":"IF('Proposta Comercial'!I78=\"\",\"\",'Proposta Comercial'!I78)","v":""},{"$f":"IF('Proposta Comercial'!J78=\"\",\"\",'Proposta Comercial'!J78)","v":""},{"$f":"IF('Proposta Comercial'!K78=\"\",\"\",'Proposta Comercial'!K78)","v":""},null,null,"00:00:00",0]
[{"$f":"IF('TDR Técnica'!A87=\"\",\"\",'TDR Técnica'!A87)","v":""},{"$f":"IF('TDR Técnica'!B87=\"\",\"\",'TDR Técnica'!B87)","v":""},{"$f":"IF('Proposta Comercial'!I79=\"\",\"\",'Proposta Comercial'!I79)","v":""},{"$f":"IF('Proposta Comercial'!J79=\"\",\"\",'Proposta Comercial'!J79)","v":""},{"$f":"IF('Proposta Comercial'!K79=\"\",\"\",'Proposta Comercial'!K79)","v":""},null,null,"00:00:00",0]
[{"$f":"IF('TDR Técnica'!A88=\"\",\"\",'TDR Técnica'!A88)","v":""},{"$f":"IF('TDR Técnica'!B88=\"\",\"\",'TDR Técnica'!B88)","v":""},{"$f":"IF('Proposta Comercial'!I80=\"\",\"\",'Proposta Comercial'!I80)","v":""},{"$f":"IF('Proposta Comercial'!J80=\"\",\"\",'Proposta Comercial'!J80)","v":""},{"$f":"IF('Proposta Comercial'!K80=\"\",\"\",'Proposta Comercial'!K80)","v":""},null,null,"00:00:00",0]
[{"$f":"IF('TDR Técnica'!A89=\"\",\"\",'TDR Técnica'!A89)","v":""},{"$f":"IF('TDR Técnica'!B89=\"\",\"\",'TDR Técnica'!B89)","v":""},{"$f":"IF('Proposta Comercial'!I81=\"\",\"\",'Proposta Comercial'!I81)","v":""},{"$f":"IF('Proposta Comercial'!J81=\"\",\"\",'Proposta Comercial'!J81)","v":""},{"$f":"IF('Proposta Comercial'!K81=\"\",\"\",'Proposta Comercial'!K81)","v":""},null,null,"00:00:00",0]
[{"$f":"IF('TDR Técnica'!A90=\"\",\"\",'TDR Técnica'!A90)","v":""},{"$f":"IF('TDR Técnica'!B90=\"\",\"\",'TDR Técnica'!B90)","v":""},{"$f":"IF('Proposta Comercial'!I82=\"\",\"\",'Proposta Comercial'!I82)","v":""},{"$f":"IF('Proposta Comercial'!J82=\"\",\"\",'Proposta Comercial'!J82)","v":""},{"$f":"IF('Proposta Comercial'!K82=\"\",\"\",'Proposta Comercial'!K82)","v":""},null,null,"00:00:00",0]
[{"$f":"IF('TDR Técnica'!A91=\"\",\"\",'TDR Técnica'!A91)","v":""},{"$f":"IF('TDR Técnica'!B91=\"\",\"\",'TDR Técnica'!B91)","v":""},{"$f":"IF('Proposta Comercial'!I83=\"\",\"\",'Proposta Comercial'!I83)","v":""},{"$f":"IF('Proposta Comercial'!J83=\"\",\"\",'Proposta Comercial'!J83)","v":""},{"$f":"IF('Proposta Comercial'!K83=\"\",\"\",'Proposta Comercial'!K83)","v":""},null,null,"00:00:00",0]
[{"$f":"IF('TDR Técnica'!A92=\"\",\"\",'TDR Técnica'!A92)","v":""},{"$f":"IF('TDR Técnica'!B92=\"\",\"\",'TDR Técnica'!B92)","v":""},{"$f":"IF('Proposta Comercial'!I84=\"\",\"\",'Proposta Comercial'!I84)","v":""},{"$f":"IF('Proposta Comercial'!J84=\"\",\"\",'Proposta Comercial'!J84)","v":""},{"$f":"IF('Proposta Comercial'!K84=\"\",\"\",'Proposta Comercial'!K84)","v":""},null,null,"00:00:00",0]
[{"$f":"IF('TDR Técnica'!A93=\"\",\"\",'TDR Técnica'!A93)","v":""},{"$f":"IF('TDR Técnica'!B93=\"\",\"\",'TDR Técnica'!B93)","v":""},{"$f":"IF('Proposta Comercial'!I85=\"\",\"\",'Proposta Comercial'!I85)","v":""},{"$f":"IF('Proposta Comercial'!J85=\"\",\"\",'Proposta Comercial'!J85)","v":""},{"$f":"IF('Proposta Comercial'!K85=\"\",\"\",'Proposta Comercial'!K85)","v":""},null,null,"00:00:00",0]
[{"$f":"IF('TDR Técnica'!A94=\"\",\"\",'TDR Técnica'!A94)","v":""},{"$f":"IF('TDR Técnica'!B94=\"\",\"\",'TDR Técnica'!B94)","v":""},{"$f":"IF('Proposta Comercial'!I86=\"\",\"\",'Proposta Comercial'!I86)","v":""},{"$f":"IF('Proposta Comercial'!J86=\"\",\"\",'Proposta Comercial'!J86)","v":""},{"$f":"IF('Proposta Comercial'!K86=\"\",\"\",'Proposta Comercial'!K86)","v":""},null,null,"00:00:00",0]
[{"$f":"IF('TDR Técnica'!A95=\"\",\"\",'TDR Técnica'!A95)","v":""},{"$f":"IF('TDR Técnica'!B95=\"\",\"\",'TDR Técnica'!B95)","v":""},{"$f":"IF('Proposta Comercial'!I87=\"\",\"\",'Proposta Comercial'!I87)","v":""},{"$f":"IF('Proposta Comercial'!J87=\"\",\"\",'Proposta Comercial'!J87)","v":""},{"$f":"IF('Proposta Comercial'!K87=\"\",\"\",'Proposta Comercial'!K87)","v":""},null,null,"00:00:00",0]
[{"$f":"IF('TDR Técnica'!A96=\"\",\"\",'TDR Técnica'!A96)","v":""},{"$f":"IF('TDR Técnica'!B96=\"\",\"\",'TDR Técnica'!B96)","v":""},{"$f":"IF('Proposta Comercial'!I88=\"\",\"\",'Proposta Comercial'!I88)","v":""},{"$f":"IF('Proposta Comercial'!J88=\"\",\"\",'Proposta Comercial'!J88)","v":""},{"$f":"IF('Proposta Comercial'!K88=\"\",\"\",'Proposta Comercial'!K88)","v":""},null,null,"00:00:00",0]
[{"$f":"IF('TDR Técnica'!A97=\"\",\"\",'TDR Técnica'!A97)","v":""},{"$f":"IF('TDR Técnica'!B97=\"\",\"\",'TDR Técnica'!B97)","v":""},{"$f":"IF('Proposta Comercial'!I89=\"\",\"\",'Proposta Comercial'!I89)","v":""},{"$f":"IF('Proposta Comercial'!J89=\"\",\"\",'Proposta Comercial'!J89)","v":""},{"$f":"IF('Proposta Comercial'!K89=\"\",\"\",'Proposta Comercial'!K89)","v":""},null,null,"00:00:00",0]
[{"$f":"IF('TDR Técnica'!A98=\"\",\"\",'TDR Técnica'!A98)","v":""},{"$f":"IF('TDR Técnica'!B98=\"\",\"\",'TDR Técnica'!B98)","v":""},{"$f":"IF('Proposta Comercial'!I90=\"\",\"\",'Proposta Comercial'!I90)","v":""},{"$f":"IF('Proposta Comercial'!J90=\"\",\"\",'Proposta Comercial'!J90)","v":""},{"$f":"IF('Proposta Comercial'!K90=\"\",\"\",'Proposta Comercial'!K90)","v":""},null,null,"00:00:00",0]
[{"$f":"IF('TDR Técnica'!A99=\"\",\"\",'TDR Técnica'!A99)","v":""},{"$f":"IF('TDR Técnica'!B99=\"\",\"\",'TDR Técnica'!B99)","v":""},{"$f":"IF('Proposta Comercial'!I91=\"\",\"\",'Proposta Comercial'!I91)","v":""},{"$f":"IF('Proposta Comercial'!J91=\"\",\"\",'Proposta Comercial'!J91)","v":""},{"$f":"IF('Proposta Comercial'!K91=\"\",\"\",'Proposta Comercial'!K91)","v":""},null,null,"00:00:00",0]
[{"$f":"IF('TDR Técnica'!A100=\"\",\"\",'TDR Técnica'!A100)","v":""},{"$f":"IF('TDR Técnica'!B100=\"\",\"\",'TDR Técnica'!B100)","v":""},{"$f":"IF('Proposta Comercial'!I92=\"\",\"\",'Proposta Comercial'!I92)","v":""},{"$f":"IF('Proposta Comercial'!J92=\"\",\"\",'Proposta Comercial'!J92)","v":""},{"$f":"IF('Proposta Comercial'!K92=\"\",\"\",'Proposta Comercial'!K92)","v":""},null,null,"00:00:00",0]
[{"$f":"IF('TDR Técnica'!A101=\"\",\"\",'TDR Técnica'!A101)","v":""},{"$f":"IF('TDR Técnica'!B101=\"\",\"\",'TDR Técnica'!B101)","v":""},{"$f":"IF('Proposta Comercial'!I93=\"\",\"\",'Proposta Comercial'!I93)","v":""},{"$f":"IF('Proposta Comercial'!J93=\"\",\"\",'Proposta Comercial'!J93)","v":""},{"$f":"IF('Proposta Comercial'!K93=\"\",\"\",'Proposta Comercial'!K93)","v":""},null,null,"00:00:00",0]
[{"$f":"IF('TDR Técnica'!A102=\"\",\"\",'TDR Técnica'!A102)","v":""},{"$f":"IF('TDR Técnica'!B102=\"\",\"\",'TDR Técnica'!B102)","v":""},{"$f":"IF('Proposta Comercial'!I94=\"\",\"\",'Proposta Comercial'!I94)","v":""},{"$f":"IF('Proposta Comercial'!J94=\"\",\"\",'Proposta Comercial'!J94)","v":""},{"$f":"IF('Proposta Comercial'!K94=\"\",\"\",'Proposta Comercial'!K94)","v":""},null,null,"00:00:00",0]
[{"$f":"IF('TDR Técnica'!A103=\"\",\"\",'TDR Técnica'!A103)","v":""},{"$f":"IF('TDR Técnica'!B103=\"\",\"\",'TDR Técnica'!B103)","v":""},{"$f":"IF('Proposta Comercial'!I95=\"\",\"\",'Proposta Comercial'!I95)","v":""},{"$f":"IF('Proposta Comercial'!J95=\"\",\"\",'Proposta Comercial'!J95)","v":""},{"$f":"IF('Proposta Comercial'!K95=\"\",\"\",'Proposta Comercial'!K95)","v":""},null,null,"00:00:00",0]
[{"$f":"IF('TDR Técnica'!A104=\"\",\"\",'TDR Técnica'!A104)","v":""},{"$f":"IF('TDR Técnica'!B104=\"\",\"\",'TDR Técnica'!B104)","v":""},{"$f":"IF('Proposta Comercial'!I96=\"\",\"\",'Proposta Comercial'!I96)","v":""},{"$f":"IF('Proposta Comercial'!J96=\"\",\"\",'Proposta Comercial'!J96)","v":""},{"$f":"IF('Proposta Comercial'!K96=\"\",\"\",'Proposta Comercial'!K96)","v":""},null,null,"00:00:00",0]
[{"$f":"IF('TDR Técnica'!A105=\"\",\"\",'TDR Técnica'!A105)","v":""},{"$f":"IF('TDR Técnica'!B105=\"\",\"\",'TDR Técnica'!B105)","v":""},{"$f":"IF('Proposta Comercial'!I97=\"\",\"\",'Proposta Comercial'!I97)","v":""},{"$f":"IF('Proposta Comercial'!J97=\"\",\"\",'Proposta Comercial'!J97)","v":""},{"$f":"IF('Proposta Comercial'!K97=\"\",\"\",'Proposta Comercial'!K97)","v":""},null,null,"00:00:00",0]
[{"$f":"IF('TDR Técnica'!A106=\"\",\"\",'TDR Técnica'!A106)","v":""},{"$f":"IF('TDR Técnica'!B106=\"\",\"\",'TDR Técnica'!B106)","v":""},{"$f":"IF('Proposta Comercial'!I98=\"\",\"\",'Proposta Comercial'!I98)","v":""},{"$f":"IF('Proposta Comercial'!J98=\"\",\"\",'Proposta Comercial'!J98)","v":""},{"$f":"IF('Proposta Comercial'!K98=\"\",\"\",'Proposta Comercial'!K98)","v":""},null,null,"00:00:00",0]
[{"$f":"IF('TDR Técnica'!A107=\"\",\"\",'TDR Técnica'!A107)","v":""},{"$f":"IF('TDR Técnica'!B107=\"\",\"\",'TDR Técnica'!B107)","v":""},{"$f":"IF('Proposta Comercial'!I99=\"\",\"\",'Proposta Comercial'!I99)","v":""},{"$f":"IF('Proposta Comercial'!J99=\"\",\"\",'Proposta Comercial'!J99)","v":""},{"$f":"IF('Proposta Comercial'!K99=\"\",\"\",'Proposta Comercial'!K99)","v":""},null,null,"00:00:00",0]
[{"$f":"IF('TDR Técnica'!A108=\"\",\"\",'TDR Técnica'!A108)","v":""},{"$f":"IF('TDR Técnica'!B108=\"\",\"\",'TDR Técnica'!B108)","v":""},{"$f":"IF('Proposta Comercial'!I100=\"\",\"\",'Proposta Comercial'!I100)","v":""},{"$f":"IF('Proposta Comercial'!J100=\"\",\"\",'Proposta Comercial'!J100)","v":""},{"$f":"IF('Proposta Comercial'!K100=\"\",\"\",'Proposta Comercial'!K100)","v":""},null,null,"00:00:00",0]
[{"$f":"IF('TDR Técnica'!A109=\"\",\"\",'TDR Técnica'!A109)","v":""},{"$f":"IF('TDR Técnica'!B109=\"\",\"\",'TDR Técnica'!B109)","v":""},{"$f":"IF('Proposta Comercial'!I101=\"\",\"\",'Proposta Comercial'!I101)","v":""},{"$f":"IF('Proposta Comercial'!J101=\"\",\"\",'Proposta Comercial'!J101)","v":""},{"$f":"IF('Proposta Comercial'!K101=\"\",\"\",'Proposta Comercial'!K101)","v":""},null,null,"00:00:00",0]
[{"$f":"IF('TDR Técnica'!A110=\"\",\"\",'TDR Técnica'!A110)","v":""},{"$f":"IF('TDR Técnica'!B110=\"\",\"\",'TDR Técnica'!B110)","v":""},{"$f":"IF('Proposta Comercial'!I102=\"\",\"\",'Proposta Comercial'!I102)","v":""},{"$f":"IF('Proposta Comercial'!J102=\"\",\"\",'Proposta Comercial'!J102)","v":""},{"$f":"IF('Proposta Comercial'!K102=\"\",\"\",'Proposta Comercial'!K102)","v":""},null,null,"00:00:00",0]
[{"$f":"IF('TDR Técnica'!A111=\"\",\"\",'TDR Técnica'!A111)","v":""},{"$f":"IF('TDR Técnica'!B111=\"\",\"\",'TDR Técnica'!B111)","v":""},{"$f":"IF('Proposta Comercial'!I103=\"\",\"\",'Proposta Comercial'!I103)","v":""},{"$f":"IF('Proposta Comercial'!J103=\"\",\"\",'Proposta Comercial'!J103)","v":""},{"$f":"IF('Proposta Comercial'!K103=\"\",\"\",'Proposta Comercial'!K103)","v":""},null,null,"00:00:00",0]
[{"$f":"IF('TDR Técnica'!A112=\"\",\"\",'TDR Técnica'!A112)","v":""},{"$f":"IF('TDR Técnica'!B112=\"\",\"\",'TDR Técnica'!B112)","v":""},{"$f":"IF('Proposta Comercial'!I104=\"\",\"\",'Proposta Comercial'!I104)","v":""},{"$f":"IF('Proposta Comercial'!J104=\"\",\"\",'Proposta Comercial'!J104)","v":""},{"$f":"IF('Proposta Comercial'!K104=\"\",\"\",'Proposta Comercial'!K104)","v":""},null,null,"00:00:00",0]
[{"$f":"IF('TDR Técnica'!A113=\"\",\"\",'TDR Técnica'!A113)","v":""},{"$f":"IF('TDR Técnica'!B113=\"\",\"\",'TDR Técnica'!B113)","v":""},{"$f":"IF('Proposta Comercial'!I105=\"\",\"\",'Proposta Comercial'!I105)","v":""},{"$f":"IF('Proposta Comercial'!J105=\"\",\"\",'Proposta Comercial'!J105)","v":""},{"$f":"IF('Proposta Comercial'!K105=\"\",\"\",'Proposta Comercial'!K105)","v":""},null,null,"00:00:00",0]
[{"$f":"IF('TDR Técnica'!A114=\"\",\"\",'TDR Técnica'!A114)","v":""},{"$f":"IF('TDR Técnica'!B114=\"\",\"\",'TDR Técnica'!B114)","v":""},{"$f":"IF('Proposta Comercial'!I106=\"\",\"\",'Proposta Comercial'!I106)","v":""},{"$f":"IF('Proposta Comercial'!J106=\"\",\"\",'Proposta Comercial'!J106)","v":""},{"$f":"IF('Proposta Comercial'!K106=\"\",\"\",'Proposta Comercial'!K106)","v":""},null,null,"00:00:00",0]
[{"$f":"IF('TDR Técnica'!A115=\"\",\"\",'TDR Técnica'!A115)","v":""},{"$f":"IF('TDR Técnica'!B115=\"\",\"\",'TDR Técnica'!B115)","v":""},{"$f":"IF('Proposta Comercial'!I107=\"\",\"\",'Proposta Comercial'!I107)","v":""},{"$f":"IF('Proposta Comercial'!J107=\"\",\"\",'Proposta Comercial'!J107)","v":""},{"$f":"IF('Proposta Comercial'!K107=\"\",\"\",'Proposta Comercial'!K107)","v":""},null,null,"00:00:00",0]
[{"$f":"IF('TDR Técnica'!A116=\"\",\"\",'TDR Técnica'!A116)","v":""},{"$f":"IF('TDR Técnica'!B116=\"\",\"\",'TDR Técnica'!B116)","v":""},{"$f":"IF('Proposta Comercial'!I108=\"\",\"\",'Proposta Comercial'!I108)","v":""},{"$f":"IF('Proposta Comercial'!J108=\"\",\"\",'Proposta Comercial'!J108)","v":""},{"$f":"IF('Proposta Comercial'!K108=\"\",\"\",'Proposta Comercial'!K108)","v":""},null,null,"00:00:00",0]
[{"$f":"IF('TDR Técnica'!A117=\"\",\"\",'TDR Técnica'!A117)","v":""},{"$f":"IF('TDR Técnica'!B117=\"\",\"\",'TDR Técnica'!B117)","v":""},{"$f":"IF('Proposta Comercial'!I109=\"\",\"\",'Proposta Comercial'!I109)","v":""},{"$f":"IF('Proposta Comercial'!J109=\"\",\"\",'Proposta Comercial'!J109)","v":""},{"$f":"IF('Proposta Comercial'!K109=\"\",\"\",'Proposta Comercial'!K109)","v":""},null,null,"00:00:00",0]
[{"$f":"IF('TDR Técnica'!A118=\"\",\"\",'TDR Técnica'!A118)","v":""},{"$f":"IF('TDR Técnica'!B118=\"\",\"\",'TDR Técnica'!B118)","v":""},{"$f":"IF('Proposta Comercial'!I110=\"\",\"\",'Proposta Comercial'!I110)","v":""},{"$f":"IF('Proposta Comercial'!J110=\"\",\"\",'Proposta Comercial'!J110)","v":""},{"$f":"IF('Proposta Comercial'!K110=\"\",\"\",'Proposta Comercial'!K110)","v":""},null,null,"00:00:00",0]
[{"$f":"IF('TDR Técnica'!A119=\"\",\"\",'TDR Técnica'!A119)","v":""},{"$f":"IF('TDR Técnica'!B119=\"\",\"\",'TDR Técnica'!B119)","v":""},{"$f":"IF('Proposta Comercial'!I111=\"\",\"\",'Proposta Comercial'!I111)","v":""},{"$f":"IF('Proposta Comercial'!J111=\"\",\"\",'Proposta Comercial'!J111)","v":""},{"$f":"IF('Proposta Comercial'!K111=\"\",\"\",'Proposta Comercial'!K111)","v":""},null,null,"00:00:00",0]